{"text_format":"1","workbook":"xlsx","n_sheets":15,"sheets":["Summary of scores (2)","Introduction","Instructions","Foire aux questions","Lignes directrices pour les AJF","Gestion de programme","Mise en œuvre de programme","TOUT – Toute incidence","Incidence MODÉRÉE","Incidence ÉLEVÉE","Résultats de programme ","Résumé des notes","Étapes suivantes","Bibliographie","Acronymes"],"not_rendered":{"charts":12,"images":1,"macros":1,"external_links":0,"defined_names":38,"comments":1,"pivot_tables":0},"unopened":[],"bounds":{"document_bytes":16777216,"sheet_cells":100000,"rows_first":2000,"rows_last":500,"rows_between":2000,"halvings":0,"cell_chars":16384,"cell_head_chars":4096},"cells_cut":0,"cells_raw":0,"read":"whole","date_system":"1900"}

{"sheet":"Summary of scores (2)","index":0,"n_rows":142,"n_cols":6,"rows_kept":142,"cut":false,"hidden":true,"merged":[[74,3,75,3],[2,2,67,2],[2,3,23,3],[24,3,45,3],[46,3,67,3],[109,2,141,2],[109,3,136,3],[137,3,141,3],[1,2,1,6],[68,2,74,2],[68,3,71,3],[72,3,73,3],[76,2,108,2],[93,3,97,3],[99,3,100,3],[101,3,108,3],[76,3,79,3],[80,3,82,3],[83,3,86,3],[87,3,89,3],[90,3,92,3]]}
[]
[null,null,"Summary of scores"]
[null,null,"Prevention\nPackages","AGYW Prevention Package\n(HIGH Incidence Locations)",null,"Risk Assessment / Profiling"]
[null,null,null,null,null,"Male and female condoms and lubricants "]
[null,null,null,null,null,"HIV testing, treatment, counselling and support"]
[null,null,null,null,null,"Pre-exposure Prophylaxis"]
[null,null,null,null,null,"STI diagnosis & service integration"]
[null,null,null,null,null,"SRH services incl. contraceptive mix"]
[null,null,null,null,null,"GBV services, post-rape care "]
[null,null,null,null,null,"Antenatal care (ANC) including PMTCT"]
{"$rows_left_out":133}
{"sheet":"Introduction","index":1,"n_rows":2,"n_cols":3,"rows_kept":2,"cut":false,"hidden":false,"merged":[[1,2,1,22]]}
[]
[null,null,"Que sont les Outils d’auto-évaluation pour la prévention du VIH (OAEP) ?"]

{"sheet":"Instructions","index":2,"n_rows":57,"n_cols":19,"rows_kept":57,"cut":false,"hidden":false,"merged":[[2,2,2,17]]}
[]
[]
[null,null,"Comment compléter l’outil d’auto-évaluation pour la prévention (OAEP) ?"]
[]
[]
[]
[]
[]
[]
[]
{"$rows_left_out":48}
{"sheet":"Foire aux questions","index":3,"n_rows":2,"n_cols":3,"rows_kept":2,"cut":false,"hidden":false,"merged":[[1,2,1,22]]}
[]
[null,null,"Foire aux questions"]

{"sheet":"Lignes directrices pour les AJF","index":4,"n_rows":2,"n_cols":3,"rows_kept":2,"cut":false,"hidden":false,"merged":[[1,2,1,22]]}
[]
[null,null,"Prévention combinée pour les adolescentes, les jeunes femmes et leurs partenaires masculins dans les régions à prévalence élevée"]

{"sheet":"Gestion de programme","index":5,"n_rows":90,"n_cols":16,"rows_kept":90,"cut":false,"hidden":false,"merged":[[18,3,18,4],[19,2,29,2],[19,3,19,4],[1,2,1,9],[3,3,3,4],[5,2,17,2],[5,3,5,4],[5,9,17,9],[4,2,4,10],[19,9,29,9],[5,5,5,8],[19,5,19,8],[64,9,73,9],[30,9,38,9],[82,3,82,4],[52,2,63,2],[52,3,52,4],[52,9,63,9],[64,3,64,4],[75,9,77,9],[82,5,82,8],[74,9,74,10],[52,6,52,8],[64,6,64,8],[80,2,81,2],[80,9,81,9],[75,2,77,2],[82,9,85,9],[51,9,51,10],[39,2,46,2],[47,2,50,2],[39,9,46,9],[47,9,50,9],[82,2,85,2],[30,3,30,4],[75,3,75,4],[30,2,38,2],[30,5,30,8],[64,2,73,2]]}
[]
[null,null,"Gestion de programme"]
[]
[null,null,"Élément","Critères",null,"S/O","Absent","Présent mais non optimal","Présent et fonctionnel","Moyenne de l’élément","Commentaires (le cas échéant)","Absent","Present","Optimal","Average","Sustainability Single Figure"]
[null,null,"Leadership et coordination"]
[null,null,"Stratégie nationale et Plan stratégique","Il existe une stratégie/politique nationale et un plan stratégique pour la prévention du VIH chez les AJF ou ils sont bien inclus dans d’autres plans de prévention du VIH et :",null,null,null,null,null,{"$f":"IFERROR(O6,\"-\")","v":"-"},null,null,null,null,{"$f":"IFERROR(ROUND(AVERAGEIF(L7:N18,\"<>0\",L7:N18),0),\"-\")","v":"-"}]
[null,null,null,"○","Des AJF ont été consultées dans l’élaboration de stratégies/plans de prévention du VIH chez les AJF",null,null,null,null,null,null,{"$f":"IF(ISBLANK(G7),0,1)","v":0},{"$f":"IF(ISBLANK(H7),0,3)","v":0},{"$f":"IF(ISBLANK(I7),0,5)","v":0}]
[null,null,null,"○","Les buts, objectifs et cibles ont été clairement définis et articulés pour le programme de prévention du VIH chez les AJF (et leurs partenaires masculins)",null,null,null,null,null,null,0,0,0]
[null,null,null,"○","Les programmes de prévention du VIH chez les AJF reconnaissent les vulnérabilités spécifiques des AJF en raison du sexe, de l’âge, du lieu, du statut socioéconomique et du niveau d’éducation, entre autres",null,null,null,null,null,null,0,0,0]
[null,null,null,"○","Un modèle logique clair ou une théorie du changement est présenté(e) dans la stratégie ou dans le plan pour guider les programmes de prévention du VIH chez les AJF",null,null,null,null,null,null,0,0,0]
{"$rows_left_out":81}
{"sheet":"Mise en œuvre de programme","index":6,"n_rows":237,"n_cols":16,"rows_kept":237,"cut":false,"hidden":false,"merged":[[226,9,229,9],[212,2,220,2],[212,3,212,4],[212,9,220,9],[221,2,225,2],[221,3,221,4],[221,9,225,9],[177,9,177,10],[201,9,205,9],[206,2,211,2],[206,3,206,4],[206,9,211,9],[178,2,187,2],[178,3,178,4],[178,9,187,9],[188,2,194,2],[188,3,188,4],[188,9,194,9],[195,2,200,2],[195,3,195,4],[195,9,200,9],[178,5,178,8],[188,5,188,8],[195,5,195,8],[133,2,136,2],[133,3,133,4],[133,9,136,9],[137,2,145,2],[137,3,137,4],[137,9,145,9],[146,2,149,2],[146,3,146,4],[146,9,149,9],[133,5,133,8],[137,5,137,8],[146,5,146,8],[151,5,151,8],[166,5,166,8],[170,5,170,8],[150,9,150,10],[151,2,164,2],[151,3,151,4],[151,9,164,9],[166,2,169,2],[166,3,166,4],[165,9,165,10],[170,2,176,2],[170,3,170,4],[170,9,176,9],[166,9,169,9],[107,2,116,2],[107,3,107,4],[107,9,116,9],[117,2,124,2],[117,3,117,4],[117,9,124,9],[125,2,132,2],[125,3,125,4],[125,9,132,9],[83,2,91,2],[83,3,83,4],[83,9,91,9],[93,2,101,2],[93,3,93,4],[93,9,101,9],[102,2,106,2],[102,3,102,4],[102,9,106,9],[92,9,92,10],[78,3,78,4],[78,2,82,2],[78,9,82,9],[48,2,58,2],[48,3,48,4],[48,9,58,9],[59,2,63,2],[59,3,59,4],[59,9,63,9],[64,2,75,2],[64,3,64,4],[64,9,75,9],[33,2,36,2],[33,3,33,4],[33,9,36,9],[38,2,47,2],[38,3,38,4],[38,9,47,9],[42,3,42,4],[77,3,77,4],[37,2,37,10],[15,2,19,2],[15,3,15,4],[15,9,19,9],[20,2,27,2],[20,3,20,4],[20,9,27,9],[29,2,32,2],[29,3,29,4],[29,9,32,9],[28,2,28,10],[1,2,1,9],[3,3,3,4],[5,2,10,2],[5,3,5,4],[5,9,10,9],[11,2,14,2],[11,3,11,4],[11,9,14,9],[4,2,4,10],[5,5,5,8],[201,5,201,8],[206,5,206,8],[212,5,212,8],[221,5,221,8],[226,5,226,8],[226,2,229,2],[226,3,226,4],[201,2,205,2],[201,3,201,4]]}
[]
[null,null,"Mise en œuvre de programme"]
[]
[null,null,"Élément","Critères",null,"S/O","Absent","Présent mais non optimal","Présent et fonctionnel","Moyenne de l’élément","Commentaires (le cas échéant)","Absent","Present","Optimal","Average","Sustainability Single Figure"]
[null,null,"Ciblage et planification"]
[null,null,"Évaluation démographique et désagrégation","Des données nationales sur l’incidence du VIH sont disponibles à partir de sources et de modèles mathématiques appropriés (à savoir des estimations infranationales de l’ONUSIDA)",null,null,null,null,null,{"$f":"IFERROR(O6,\"-\")","v":"-"},null,null,null,null,{"$f":"IFERROR(ROUND(AVERAGEIF(L7:N11,\"<>0\",L7:N11),0),\"-\")","v":"-"}]
[null,null,null,"○","Les données sont désagrégées par âge, sexe et lieu",null,null,null,null,null,null,{"$f":"IF(ISBLANK(G7),0,1)","v":0},{"$f":"IF(ISBLANK(H7),0,3)","v":0},{"$f":"IF(ISBLANK(I7),0,5)","v":0}]
[null,null,null,"○","Les schémas d’incidence/transmission au niveau national sont identifiés et analysés, y compris les interactions possibles entre les AJF et d’autres groupes d’âge de femmes et d’hommes",null,null,null,null,null,null,{"$f":"IF(ISBLANK(G8),0,1)","v":0},{"$f":"IF(ISBLANK(H8),0,3)","v":0},{"$f":"IF(ISBLANK(I8),0,5)","v":0}]
[null,null,null,"○","Les informations sont utilisées pour déterminer les besoins en matière de prestation de services dans les domaines de la santé, de l’éducation et des plateformes communautaires",null,null,null,null,null,null,{"$f":"IF(ISBLANK(G9),0,1)","v":0},{"$f":"IF(ISBLANK(H9),0,3)","v":0},{"$f":"IF(ISBLANK(I9),0,5)","v":0}]
[null,null,null,"○","Ces informations sont utilisées pour estimer les besoins de financement et fixer des cibles",null,null,null,null,null,null,{"$f":"IF(ISBLANK(G10),0,1)","v":0},{"$f":"IF(ISBLANK(H10),0,3)","v":0},{"$f":"IF(ISBLANK(I10),0,5)","v":0}]
{"$rows_left_out":228}
{"sheet":"TOUT – Toute incidence","index":7,"n_rows":147,"n_cols":15,"rows_kept":147,"cut":false,"hidden":false,"merged":[[4,2,4,10],[1,2,1,9],[3,3,3,4],[5,2,13,2],[5,3,5,4],[5,9,13,9],[13,3,13,4],[5,5,5,8],[14,9,30,9],[30,3,30,4],[31,3,31,4],[31,9,36,9],[36,3,36,4],[14,5,14,8],[31,5,31,8],[37,9,49,9],[44,3,44,4],[49,3,49,4],[44,5,44,8],[37,5,37,8],[78,9,89,9],[89,3,89,4],[50,2,67,2],[50,3,50,4],[50,9,67,9],[55,3,55,4],[62,3,62,4],[68,2,77,2],[77,3,77,4],[68,9,77,9],[50,5,50,8],[62,5,62,8],[78,2,89,2],[90,9,96,9],[96,3,96,4],[97,3,97,4],[97,9,102,9],[102,3,102,4],[90,5,90,8],[97,5,97,8],[103,9,109,9],[109,3,109,4],[110,3,110,4],[110,5,110,8],[110,9,118,9],[103,5,103,8],[142,2,143,2],[135,9,141,9],[141,3,141,4],[118,3,118,4],[119,3,119,4],[119,9,121,9],[121,3,121,4],[122,3,122,4],[122,9,134,9],[134,3,134,4],[119,5,119,8],[122,5,122,8],[135,5,135,8],[142,9,143,9],[135,2,141,2],[135,3,135,4],[103,2,109,2],[103,3,103,4],[90,2,96,2],[90,3,90,4],[122,2,134,2],[119,2,121,2],[110,2,118,2],[97,2,102,2],[31,2,36,2],[14,2,30,2],[68,5,68,8],[78,5,78,8],[67,3,67,4],[68,3,68,4],[78,3,78,4],[37,2,49,2],[37,3,37,4],[14,3,14,4]]}
[]
[null,null,"Mise en œuvre de programme"]
[]
[null,null,"Élément","Critères",null,"S/O","Absent","Présent mais non optimal","Présent et fonctionnel","Moyenne de l’élément","Commentaires (le cas échéant)","Absent","Present","Optimal","Average"]
[null,null,"Facteurs favorables au Programme national de prévention du VIH sur TOUS les sites"]
[null,null,"Accès à l’enseignement primaire et secondaire ","Des efforts visant à accroître l’accès des AJF à l’éducation ont été mis en œuvre avec succès et incluent : ",null,null,null,null,null,{"$f":"IFERROR(O6,\"-\")","v":"-"},null,null,null,null,{"$f":"IFERROR(ROUND(AVERAGEIF(L7:N14,\"<>0\",L7:N14),0),\"-\")","v":"-"}]
[null,null,null,"○","Rendre l’école primaire et secondaire obligatoire",null,null,null,null,null,null,{"$f":"IF(ISBLANK(G7),0,1)","v":0},{"$f":"IF(ISBLANK(H7),0,3)","v":0},{"$f":"IF(ISBLANK(I7),0,5)","v":0}]
[null,null,null,"○","Scolarité gratuite ou subventions pour les familles pauvres dans les pays affichant de faibles taux de scolarisation",null,null,null,null,null,null,0,0,0]
[null,null,null,"○","Construction d’écoles dans les zones rurales afin de réduire les distances à parcourir pour les JFA",null,null,null,null,null,null,0,0,0]
[null,null,null,"○","Accès aux uniformes scolaires et aux programmes d’alimentation ",null,null,null,null,null,null,0,0,0]
{"$rows_left_out":138}
{"sheet":"Incidence MODÉRÉE","index":8,"n_rows":61,"n_cols":15,"rows_kept":61,"cut":false,"hidden":false,"merged":[[1,2,1,9],[3,3,3,4],[55,3,55,4],[51,2,52,2],[51,3,51,4],[51,9,52,9],[53,3,53,4],[53,2,54,2],[53,9,54,9],[37,2,39,2],[37,3,37,4],[40,2,42,2],[28,2,31,2],[28,3,28,4],[28,9,31,9],[32,2,34,2],[40,3,40,4],[40,9,42,9],[20,3,20,4],[20,2,23,2],[24,3,24,4],[32,3,32,4],[37,9,39,9],[35,2,36,2],[35,3,35,4],[35,9,36,9],[17,2,19,2],[32,9,34,9],[24,9,27,9],[17,3,17,4],[17,9,19,9],[20,9,23,9],[24,2,27,2],[5,2,8,2],[5,3,5,4],[5,9,8,9],[13,3,13,4],[9,2,12,2],[9,3,9,4],[9,9,12,9],[13,2,16,2],[13,9,16,9],[4,2,4,10],[56,3,56,4],[43,3,43,4],[43,9,45,9],[46,2,48,2],[46,3,46,4],[46,9,48,9],[49,2,50,2],[49,3,49,4],[49,9,50,9],[43,2,45,2]]}
[]
[null,null,"Mise en œuvre de programme"]
[]
[null,null,"Élément","Critères",null,"S/O","Absent","Présent mais non optimal","Présent et fonctionnel","Moyenne de l’élément","Commentaires (le cas échéant)","Absent","Present","Optimal","Average"]
[null,null,"Paquets de prévention du VIH pour les AJF dans les lieux à incidence MODÉRÉE"]
[null,null,"Profil d’évaluation des risques liés au VIH et aux IST","Un profil d’évaluation des risques liés au VIH et aux IST est proposé : ",null,null,null,null,null,{"$f":"IFERROR(O6,\"-\")","v":"-"},null,null,null,null,{"$f":"IFERROR(ROUND(AVERAGEIF(L7:N9,\"<>0\",L7:N9),0),\"-\")","v":"-"}]
[null,null,null,"○","De façon routinière",null,null,null,null,null,null,{"$f":"IF(ISBLANK(G7),0,1)","v":0},{"$f":"IF(ISBLANK(H7),0,3)","v":0},{"$f":"IF(ISBLANK(I7),0,5)","v":0}]
[null,null,null,"○","Dans toutes les plateformes sanitaires et communautaires (points de prestation de services et établissements)",null,null,null,null,null,null,0,0,0]
[null,null,null,null,"Avec utilisation de mécanismes de financement de la prévention du VIH chez les AJF ",null,null,null,null,null,null,0,0,0]
[null,null,"Conseil en matière de réduction des risques liés au VIH et dépistage","Des conseils en matière de réduction des risques liés au VIH et des tests dépistage sont proposés :",null,null,null,null,null,{"$f":"IFERROR(O10,\"-\")","v":"-"},null,null,null,null,{"$f":"IFERROR(ROUND(AVERAGEIF(L11:N13,\"<>0\",L11:N13),0),\"-\")","v":"-"}]
{"$rows_left_out":52}
{"sheet":"Incidence ÉLEVÉE","index":9,"n_rows":79,"n_cols":15,"rows_kept":79,"cut":false,"hidden":false,"merged":[[41,5,41,8],[1,2,1,9],[3,3,3,4],[5,2,8,2],[5,3,5,4],[5,9,8,9],[4,2,4,10],[5,5,5,8],[28,2,32,2],[28,3,28,4],[28,9,32,9],[13,2,17,2],[13,3,13,4],[13,9,17,9],[18,2,22,2],[18,9,22,9],[9,2,12,2],[9,9,12,9],[23,2,27,2],[23,3,23,4],[23,9,27,9],[18,3,18,4],[57,2,60,2],[57,3,57,4],[57,9,60,9],[41,2,43,2],[41,3,41,4],[41,9,43,9],[44,2,46,2],[44,3,44,4],[44,9,46,9],[47,2,49,2],[47,3,47,4],[47,9,49,9],[50,2,53,2],[50,3,50,4],[33,2,37,2],[38,2,40,2],[50,9,53,9],[54,2,56,2],[54,3,54,4],[54,9,56,9],[43,4,43,5],[49,4,49,5],[38,3,38,4],[38,9,40,9],[33,9,37,9],[33,3,33,4],[69,3,69,4],[70,3,70,4],[61,2,64,2],[61,3,61,4],[61,9,64,9],[65,2,68,2],[65,3,65,4],[65,9,68,9]]}
[]
[null,null,"Mise en œuvre de programme"]
[]
[null,null,"Élément","Critères",null,"S/O","Absent","Présent mais non optimal","Présent et fonctionnel","Moyenne de l’élément","Commentaires (le cas échéant)","Absent","Present","Optimal","Average"]
[null,null,"Paquets de prévention du VIH pour les AJF dans les lieux à incidence MODÉRÉE"]
[null,null,"Profil d’évaluation des risques liés au VIH et aux IST","Un profil d’évaluation des risques liés au VIH et aux IST est proposé : ",null,null,null,null,null,{"$f":"IFERROR(O6,\"-\")","v":"-"},null,null,null,null,{"$f":"IFERROR(ROUND(AVERAGEIF(L7:N9,\"<>0\",L7:N9),0),\"-\")","v":"-"}]
[null,null,null,"○","De façon routinière",null,null,null,null,null,null,{"$f":"IF(ISBLANK(G7),0,1)","v":0},{"$f":"IF(ISBLANK(H7),0,3)","v":0},{"$f":"IF(ISBLANK(I7),0,5)","v":0}]
[null,null,null,"○","Dans toutes les plateformes sanitaires et communautaires (points de prestation de services et établissements)",null,null,null,null,null,null,0,0,0]
[null,null,null,null,"Avec utilisation de mécanismes de financement de la prévention du VIH chez les AJF ",null,null,null,null,null,null,0,0,0]
[null,null,"Conseil en matière de réduction des risques liés au VIH et dépistage","Des conseils en matière de réduction des risques liés au VIH et des tests dépistage sont proposés :",null,null,null,null,null,{"$f":"IFERROR(O10,\"-\")","v":"-"},null,null,null,null,{"$f":"IFERROR(ROUND(AVERAGEIF(L11:N13,\"<>0\",L11:N13),0),\"-\")","v":"-"}]
{"$rows_left_out":70}
{"sheet":"Résultats de programme ","index":10,"n_rows":29,"n_cols":15,"rows_kept":29,"cut":false,"hidden":false,"merged":[[1,2,1,9],[3,3,3,4],[4,2,4,9],[6,2,6,4],[7,2,7,4],[8,2,8,4],[9,2,9,4],[15,2,15,4],[10,2,10,4],[11,2,11,4],[12,2,12,4],[13,2,13,4],[20,2,20,4],[22,2,22,4],[24,2,24,4],[16,2,16,4],[17,2,17,4],[18,2,18,4],[19,2,19,4],[21,2,21,4],[23,2,23,4]]}
[]
[null,null,"Résultats de programme"]
[]
[null,null,"Élément","Critères",null,"S/O","Pas d’objectif","Objectif non atteint ou non conforme aux prévisions","Objectif atteint ou en passe de l’être","Moyenne de l’élément","Commentaires          (le cas échéant)","Absent","Present","Optimal","Average"]
[null,null,"Résultats et indicateurs"]
[null,null,"Indicateurs clés"]
[null,null,"Nombre de nouvelles infections au VIH parmi les AJF",null,null,null,null,null,null,{"$f":"IFERROR(O7,\"-\")","v":"-"},null,{"$f":"IF(ISBLANK(G7),0,1)","v":0},{"$f":"IF(ISBLANK(H7),0,3)","v":0},{"$f":"IF(ISBLANK(I7),0,5)","v":0},{"$f":"IFERROR(IF(ISBLANK(G7),ROUND(AVERAGEIF(L7:N7,\"<>0\",L7:N7),0),L7),\"-\")","v":"-"}]
[null,null,"Pourcentage d’AJF (estimatif) vivant avec le VIH qui connaissent leur statut",null,null,null,null,null,null,"-",null,0,0,0,{"$f":"IFERROR(IF(ISBLANK(G8),ROUND(AVERAGEIF(L8:N8,\"<>0\",L8:N8),0),L8),\"-\")","v":"-"}]
[null,null,"Pourcentage d’AJF vivant avec le VIH et sous traitement antirétroviral qui sont virologiquement négatives",null,null,null,null,null,null,{"$f":"IFERROR(O9,\"-\")","v":"-"},null,{"$f":"IF(ISBLANK(G9),0,1)","v":0},{"$f":"IF(ISBLANK(H9),0,3)","v":0},{"$f":"IF(ISBLANK(I9),0,5)","v":0},{"$f":"IFERROR(IF(ISBLANK(G9),ROUND(AVERAGEIF(L9:N9,\"<>0\",L9:N9),0),L9),\"-\")","v":"-"}]
[null,null,"Pourcentage de partenaires masculins vivant avec le VIH et sous traitement antirétroviral qui sont virologiquement négatifs",null,null,null,null,null,null,"-",null,0,0,0,"-"]
{"$rows_left_out":20}
{"sheet":"Résumé des notes","index":11,"n_rows":104,"n_cols":11,"rows_kept":104,"cut":false,"hidden":false,"merged":[[1,2,1,6],[8,3,9,3],[10,3,14,3],[2,3,7,3],[2,2,14,2],[47,3,60,3],[61,3,78,3],[47,2,78,2],[79,3,86,3],[87,3,96,3],[79,2,98,2],[15,2,46,2],[15,3,18,3],[19,3,20,3],[21,3,24,3],[25,3,27,3],[28,3,35,3],[37,3,38,3],[39,3,46,3]]}
[]
[null,null,"Résumé des notes"]
[null,null,"Gestion de programme","Leadership et coordination",null,"Stratégie nationale et Plan stratégique",{"$f":"'Gestion de programme'!O6","v":"-"}]
[null,null,null,null,null,"Plans nationaux et infranationaux",{"$f":"'Gestion de programme'!O19","v":"-"}]
[null,null,null,null,null,"Groupe de travail technique national (GTT) pour la prévention chez les AJF/jeunes",{"$f":"'Gestion de programme'!O20","v":"-"}]
[null,null,null,null,null,"Obligation de rendre compte",{"$f":"'Gestion de programme'!O31","v":"-"}]
[null,null,null,null,null,"Plan de renforcement des capacités et d’assistance technique",{"$f":"'Gestion de programme'!O40","v":"-"}]
[null,null,null,null,null,"Plan de durabilité et feuille de route de transition",{"$f":"'Gestion de programme'!O48","v":"-"}]
[null,null,null,"Stratégie, politique et réglementation",null,"Politiques et lois",{"$f":"'Gestion de programme'!O53","v":"-"}]
[null,null,null,null,null,"Lignes directrices",{"$f":"'Gestion de programme'!O65","v":"-"}]
{"$rows_left_out":95}
{"sheet":"Étapes suivantes","index":12,"n_rows":54,"n_cols":8,"rows_kept":54,"cut":false,"hidden":false,"merged":[[1,2,1,8],[11,2,11,3]]}
[]
[null,null,"Étapes suivantes"]
[]
[null,null,null,null,null,"Élément à traiter/améliorer","Raison de la mauvaise performance","Actions proposées (ex. : soutien requis ou actions correctives). Le cas échéant, veillez à désagréger les actions proposées par catégorie d’âge : 15-19, 20-24 et 25-29 ans"]
[null,null,null,null,1,{"$f":"IFERROR(INDEX('Résumé des notes'!$F$1:$F$99,SMALL(IF('Résumé des notes'!$G$1:$G$99<=$C$12,ROW('Résumé des notes'!$G$1:$G$99)),ROW(3:3))),\"\")","v":""}]
[null,null,null,null,2,{"$f":"IFERROR(INDEX('Résumé des notes'!$F$1:$F$99,SMALL(IF('Résumé des notes'!$G$1:$G$99<=$C$12,ROW('Résumé des notes'!$G$1:$G$99)),ROW(4:4))),\"\")","v":""}]
[null,null,null,null,3,{"$f":"IFERROR(INDEX('Résumé des notes'!$F$1:$F$99,SMALL(IF('Résumé des notes'!$G$1:$G$99<=$C$12,ROW('Résumé des notes'!$G$1:$G$99)),ROW(5:5))),\"\")","v":""}]
[null,null,null,null,4,{"$f":"IFERROR(INDEX('Résumé des notes'!$F$1:$F$99,SMALL(IF('Résumé des notes'!$G$1:$G$99<=$C$12,ROW('Résumé des notes'!$G$1:$G$99)),ROW(6:6))),\"\")","v":""}]
[null,null,null,null,5,{"$f":"IFERROR(INDEX('Résumé des notes'!$F$1:$F$99,SMALL(IF('Résumé des notes'!$G$1:$G$99<=$C$12,ROW('Résumé des notes'!$G$1:$G$99)),ROW(7:7))),\"\")","v":""}]
[null,null,null,null,6,{"$f":"IFERROR(INDEX('Résumé des notes'!$F$1:$F$99,SMALL(IF('Résumé des notes'!$G$1:$G$99<=$C$12,ROW('Résumé des notes'!$G$1:$G$99)),ROW(8:8))),\"\")","v":""}]
{"$rows_left_out":45}
{"sheet":"Bibliographie","index":13,"n_rows":53,"n_cols":4,"rows_kept":53,"cut":false,"hidden":false,"merged":[[1,2,1,3]]}
[]
[null,null,"Bibliographie"]
[null,null,1,"Global Fund. (2018). Measurement framework for adolescent girls and young women. "]
[null,null,2,"Global HIV Prevention Coalition (2020). Decision-making Aide for Investments into HIV Prevention Programmes among Adolescent Girls and Young Women "]
[null,null,3,"International AIDS Society. (2018). Differentiated service delivery for HIV: A decision framework for HIV testing services. "]
[null,null,4,"International AIDS Society. (2018). Differentiated service delivery: A decision framework for differentiated antiretroviral therapy for key populations. "]
[null,null,5,"Joint United Nations Programme on HIV/AIDS (UNAIDS). (2016). HIV prevention among adolescent girls and young women. Geneva, Switzerland."]
[null,null,6,"Joint United Nations Programme on HIV/AIDS. (2008). A framework for monitoring and evaluating HIV prevention programmes for most-at-risk populations. Geneva: UNAIDS."]
[null,null,7,"Joint United Nations Programme on HIV/AIDS. (2012). Key programmes to reduce stigma and discrimination and increase access to justice in national HIV responses. Guidance Note"]
[null,null,8,"Joint United Nations Programme on HIV/AIDS. (2016). HIV prevention among adolescent girls and young women: Putting HIV prevention among adolescent girls and young women on the fast-track and engaging men and boys."]
{"$rows_left_out":44}
{"sheet":"Acronymes","index":14,"n_rows":36,"n_cols":4,"rows_kept":36,"cut":false,"hidden":false,"merged":[[1,2,1,3]]}
[]
[null,null,"Acronymes"]
[null,null,"Adolescentes et jeunes femmes ","AJF"]
[null,null,"Accès libre","AL"]
[null,null,"Assistance technique","AT"]
[null,null,"Communication sur le changement de comportement social","CCCS"]
[null,null,"Code d’identification unique","CIU"]
[null,null,"Circoncision masculine médicale volontaire","CMMV"]
[null,null,"Éducation sexuelle complète","ESC"]
[null,null,"Estimation de la taille de la population","ETP"]
{"$rows_left_out":26}