{"text_format":"1","workbook":"xlsx","n_sheets":15,"sheets":["Summary of scores (2)","Introdução","Instruções","Perguntas Frequentes","Guiao para RMAJ","Gestão do Programa","Implementação do Programa","Todos -Independ. da Incidencia","Incidencia Moderada","Alta Incidencia","Resultados do Programa","Resumo da Pontuação","Próximos Passos","Bibliografia","Acrónimos"],"not_rendered":{"charts":12,"images":1,"macros":1,"external_links":0,"defined_names":37,"comments":1,"pivot_tables":0},"unopened":[],"bounds":{"document_bytes":16777216,"sheet_cells":100000,"rows_first":2000,"rows_last":500,"rows_between":2000,"halvings":0,"cell_chars":16384,"cell_head_chars":4096},"cells_cut":0,"cells_raw":0,"read":"whole","date_system":"1900"}

{"sheet":"Summary of scores (2)","index":0,"n_rows":142,"n_cols":6,"rows_kept":142,"cut":false,"hidden":true,"merged":[[74,3,75,3],[2,2,67,2],[2,3,23,3],[24,3,45,3],[46,3,67,3],[109,2,141,2],[109,3,136,3],[137,3,141,3],[1,2,1,6],[68,2,74,2],[68,3,71,3],[72,3,73,3],[76,2,108,2],[93,3,97,3],[99,3,100,3],[101,3,108,3],[76,3,79,3],[80,3,82,3],[83,3,86,3],[87,3,89,3],[90,3,92,3]]}
[]
[null,null,"Summary of scores"]
[null,null,"Prevention\nPackages","AGYW Prevention Package\n(HIGH Incidence Locations)",null,"Risk Assessment / Profiling"]
[null,null,null,null,null,"Male and female condoms and lubricants "]
[null,null,null,null,null,"HIV testing, treatment, counselling and support"]
[null,null,null,null,null,"Pre-exposure Prophylaxis"]
[null,null,null,null,null,"STI diagnosis & service integration"]
[null,null,null,null,null,"SRH services incl. contraceptive mix"]
[null,null,null,null,null,"GBV services, post-rape care "]
[null,null,null,null,null,"Antenatal care (ANC) including PMTCT"]
{"$rows_left_out":133}
{"sheet":"Introdução","index":1,"n_rows":2,"n_cols":3,"rows_kept":2,"cut":false,"hidden":false,"merged":[[1,2,1,22]]}
[]
[null,null,"O que são Ferramentas de Auto-avaliação para a Prevenção do HIV (PSAT)?"]

{"sheet":"Instruções","index":2,"n_rows":3,"n_cols":3,"rows_kept":3,"cut":false,"hidden":false,"merged":[[2,2,2,17]]}
[]
[]
[null,null,"Como preencher a Ferramenta de Auto-avaliação para a Prevenção (PSAT)"]

{"sheet":"Perguntas Frequentes","index":3,"n_rows":2,"n_cols":3,"rows_kept":2,"cut":false,"hidden":false,"merged":[[1,2,1,22]]}
[]
[null,null,"Perguntas Frequentes"]

{"sheet":"Guiao para RMAJ","index":4,"n_rows":2,"n_cols":3,"rows_kept":2,"cut":false,"hidden":false,"merged":[[1,2,1,22]]}
[]
[null,null,"Combinação de prevenção para raparigas adolescentes e mulheres jovens e os seus parceiros masculinos em locais de prevalência elevada"]

{"sheet":"Gestão do Programa","index":5,"n_rows":90,"n_cols":16,"rows_kept":90,"cut":false,"hidden":false,"merged":[[82,2,85,2],[18,3,18,4],[19,2,29,2],[19,3,19,4],[1,2,1,9],[3,3,3,4],[5,2,17,2],[5,3,5,4],[5,9,17,9],[19,9,29,9],[5,5,5,8],[19,5,19,8],[4,2,4,11],[82,3,82,4],[82,9,84,9],[52,2,63,2],[52,9,63,9],[64,3,64,4],[75,9,77,9],[82,5,82,8],[52,6,52,8],[64,6,64,8],[80,2,81,2],[80,9,81,9],[75,2,77,2],[30,3,30,4],[30,9,37,9],[75,3,75,4],[30,2,38,2],[30,5,30,8],[39,9,46,9],[47,9,50,9],[64,2,73,2],[64,9,73,9],[51,2,51,11],[74,2,74,11],[39,2,50,2],[52,3,52,4]]}
[]
[null,null,"Gestão do Programa"]
[]
[null,null,"Elemento","Critérios",null,"N/A","Ausente","Presente mas não ideal","Presente e a funcionar bem","Média do elemento","Comentários (se existentes)","Absent","Present","Optimal","Average","Sustainability Single Figure"]
[null,null,"Liderança e Coordenação"]
[null,null,"Estratégia Nacional e Plano Estratégico","Existe uma estratégia/política nacional e um plano estratégico para a prevenção do HIV para RAMJ ou estão bem incluídos noutro plano de prevenção do HIV e:",null,null,null,null,null,{"$f":"IFERROR(O6,\"-\")","v":"-"},null,null,null,null,{"$f":"IFERROR(ROUND(AVERAGEIF(L7:N18,\"<>0\",L7:N18),0),\"-\")","v":"-"}]
[null,null,null,"○","As RAMJ foram consultadas para a elaboração de estratégias/planos de prevenção do HIV para RAMJ",null,null,null,null,null,null,{"$f":"IF(ISBLANK(G7),0,1)","v":0},{"$f":"IF(ISBLANK(H7),0,3)","v":0},{"$f":"IF(ISBLANK(I7),0,5)","v":0}]
[null,null,null,"○","Os objectivos e metas foram claramente definidos e articulados para o programa de prevenção do HIV para RAMJ (e os seus parceiros masculinos)",null,null,null,null,null,null,0,0,0]
[null,null,null,"○","Os programas de prevenção do HIV para RAMJ reconhecem vulnerabilidades específicas de RAMJ devido ao sexo, idade, estatuto socioeconómico, localização e grau de escolaridade, entre outros",null,null,null,null,null,null,0,0,0]
[null,null,null,"○","Um modelo lógico claro ou teoria de mudança é apresentado na estratégia/plano para orientar os programas de prevenção do HIV para RAMJ",null,null,null,null,null,null,0,0,0]
{"$rows_left_out":81}
{"sheet":"Implementação do Programa","index":6,"n_rows":237,"n_cols":16,"rows_kept":237,"cut":false,"hidden":false,"merged":[[226,9,229,9],[212,2,220,2],[212,3,212,4],[212,9,220,9],[221,2,225,2],[221,3,221,4],[221,9,225,9],[177,9,177,10],[201,9,205,9],[206,2,211,2],[206,3,206,4],[206,9,211,9],[178,2,187,2],[178,3,178,4],[178,9,187,9],[188,2,194,2],[188,3,188,4],[188,9,194,9],[195,2,200,2],[195,3,195,4],[195,9,200,9],[178,5,178,8],[188,5,188,8],[195,5,195,8],[133,2,136,2],[133,3,133,4],[133,9,136,9],[137,2,145,2],[137,3,137,4],[137,9,145,9],[146,2,149,2],[146,3,146,4],[146,9,149,9],[133,5,133,8],[137,5,137,8],[146,5,146,8],[151,5,151,8],[166,5,166,8],[170,5,170,8],[150,9,150,10],[151,2,164,2],[151,3,151,4],[151,9,164,9],[166,2,169,2],[166,3,166,4],[170,2,176,2],[170,3,170,4],[170,9,176,9],[166,9,169,9],[150,2,150,4],[165,2,165,10],[106,2,116,2],[106,3,106,4],[106,9,116,9],[117,2,124,2],[117,3,117,4],[117,9,124,9],[125,2,132,2],[125,3,125,4],[125,9,132,9],[106,5,106,8],[117,5,117,8],[125,5,125,8],[82,2,90,2],[82,3,82,4],[82,9,90,9],[92,2,100,2],[92,3,92,4],[92,9,100,9],[101,2,105,2],[101,3,101,4],[101,9,105,9],[82,5,82,8],[92,5,92,8],[101,5,101,8],[91,2,91,10],[77,3,77,4],[77,2,81,2],[77,9,81,9],[47,2,57,2],[47,3,47,4],[47,9,57,9],[58,2,62,2],[58,3,58,4],[58,9,62,9],[63,2,74,2],[63,3,63,4],[63,9,74,9],[77,5,77,8],[75,2,75,10],[32,2,35,2],[32,3,32,4],[32,9,35,9],[37,2,46,2],[37,3,37,4],[37,9,46,9],[41,3,41,4],[76,3,76,4],[36,2,36,10],[32,5,32,8],[37,5,37,8],[41,5,41,8],[47,5,47,8],[58,5,58,8],[63,5,63,8],[15,2,18,2],[15,3,15,4],[15,9,18,9],[19,2,26,2],[19,3,19,4],[19,9,26,9],[28,2,31,2],[28,3,28,4],[28,9,31,9],[27,2,27,10],[15,5,15,8],[19,5,19,8],[28,5,28,8],[1,2,1,9],[3,3,3,4],[5,2,10,2],[5,3,5,4],[5,9,10,9],[11,2,14,2],[11,3,11,4],[11,9,14,9],[4,2,4,10],[5,5,5,8],[11,5,11,8],[201,5,201,8],[206,5,206,8],[212,5,212,8],[221,5,221,8],[226,5,226,8],[226,2,229,2],[226,3,226,4],[201,2,205,2],[201,3,201,4]]}
[]
[null,null,"Implementação do Programa"]
[]
[null,null,"Elemento","Critérios",null,"N/A","Ausente","Presente mas não ideal","Presente e a funcionar bem","Média do elemento","Comentários (se existentes)","Absent","Present","Optimal","Average","Sustainability Single Figure"]
[null,null,"Definição de metas e planificação"]
[null,null,"Avaliação demográfica e disagregação","Os dados nacionais sobre a incidência do HIV estão disponíveis em fontes apropriadas e modelos matemáticos (isto é, estimativas provinciais e distritais do ONUSIDA) ",null,null,null,null,null,{"$f":"IFERROR(O6,\"-\")","v":"-"},null,null,null,null,{"$f":"IFERROR(ROUND(AVERAGEIF(L7:N11,\"<>0\",L7:N11),0),\"-\")","v":"-"}]
[null,null,null,"○","Os dados são desagregados por idade, sexo e localização",null,null,null,null,null,null,{"$f":"IF(ISBLANK(G7),0,1)","v":0},{"$f":"IF(ISBLANK(H7),0,3)","v":0},{"$f":"IF(ISBLANK(I7),0,5)","v":0}]
[null,null,null,"○","São identificados e analisados os padrões de incidência/transmissão a nível do país - incluindo possíveis interacções entre RAMJ e outros grupos etários de mulheres/homens. ",null,null,null,null,null,null,{"$f":"IF(ISBLANK(G8),0,1)","v":0},{"$f":"IF(ISBLANK(H8),0,3)","v":0},{"$f":"IF(ISBLANK(I8),0,5)","v":0}]
[null,null,null,"○","A informação é utilizada para informar a necessidade de prestação de serviços através de plataformas de saúde, de educação e da comunidade",null,null,null,null,null,null,{"$f":"IF(ISBLANK(G9),0,1)","v":0},{"$f":"IF(ISBLANK(H9),0,3)","v":0},{"$f":"IF(ISBLANK(I9),0,5)","v":0}]
[null,null,null,"○","Esta informação é utilizada para estimar as necessidades de financiamento e definir objectivos",null,null,null,null,null,null,{"$f":"IF(ISBLANK(G10),0,1)","v":0},{"$f":"IF(ISBLANK(H10),0,3)","v":0},{"$f":"IF(ISBLANK(I10),0,5)","v":0}]
{"$rows_left_out":228}
{"sheet":"Todos -Independ. da Incidencia","index":7,"n_rows":147,"n_cols":16,"rows_kept":147,"cut":false,"hidden":false,"merged":[[31,5,31,8],[4,2,4,10],[1,2,1,9],[3,3,3,4],[5,2,13,2],[5,3,5,4],[5,9,13,9],[13,3,13,4],[5,5,5,8],[37,2,49,2],[37,3,37,4],[14,2,29,2],[14,3,14,4],[37,9,49,9],[44,3,44,4],[49,3,49,4],[44,5,44,8],[37,5,37,8],[14,9,30,9],[30,3,30,4],[31,2,35,2],[31,3,31,4],[31,9,36,9],[36,3,36,4],[14,5,14,8],[67,3,67,4],[68,3,68,4],[78,2,88,2],[78,3,78,4],[78,9,89,9],[89,3,89,4],[50,2,67,2],[50,3,50,4],[50,9,67,9],[55,3,55,4],[62,3,62,4],[68,2,77,2],[77,3,77,4],[68,9,77,9],[50,5,50,8],[62,5,62,8],[90,9,96,9],[96,3,96,4],[97,2,101,2],[97,3,97,4],[97,9,102,9],[102,3,102,4],[103,9,109,9],[109,3,109,4],[110,2,117,2],[110,3,110,4],[110,9,117,9],[110,5,110,8],[142,2,143,2],[135,9,141,9],[141,3,141,4],[118,3,118,4],[119,2,120,2],[119,3,119,4],[119,9,121,9],[121,3,121,4],[122,2,133,2],[122,3,122,4],[122,9,134,9],[134,3,134,4],[119,5,119,8],[122,5,122,8],[135,5,135,8],[142,9,143,9],[135,2,141,2],[135,3,135,4],[103,2,109,2],[103,3,103,4],[90,2,96,2],[90,3,90,4],[68,5,68,8],[78,5,78,8],[90,5,90,8],[97,5,97,8],[103,5,103,8]]}
[]
[null,null,"Implementação do Programa"]
[]
[null,null,"Elemento","Critérios",null,"N/A","Ausente","Presente mas não ideal","Presente e a funcionar bem","Média do elemento","Commentários (se aplicavél)","Absent","Present","Optimal","Average"]
[null,null,"Facilitadores do Programa Nacional de Prevenção do HIV em TODOS os locais"]
[null,null,"Accesso à educação primária e secundária","Esforços para aumentar o acesso à educação de RAMJ implementados com sucesso e incluem:  ",null,null,null,null,null,{"$f":"IFERROR(O6,\"-\")","v":"-"},null,null,null,null,{"$f":"IFERROR(ROUND(AVERAGEIF(L7:N14,\"<>0\",L7:N14),0),\"-\")","v":"-"}]
[null,null,null,"○","Tornar obrigatório o ensino primário e secundário",null,null,null,null,null,null,{"$f":"IF(ISBLANK(G7),0,1)","v":0},{"$f":"IF(ISBLANK(H7),0,3)","v":0},{"$f":"IF(ISBLANK(I7),0,5)","v":0}]
[null,null,null,"○","Isenção de taxa de matrícula para famílias desfavorecidas nos países onde a matrícula é baixa",null,null,null,null,null,null,0,0,0]
[null,null,null,"○","Construção de escolas nas zonas rurais para reduzir distâncias para RAMJ",null,null,null,null,null,null,0,0,0]
[null,null,null,"○","Acesso a uniformes escolares e programas de alimentação",null,null,null,null,null,null,0,0,0]
{"$rows_left_out":138}
{"sheet":"Incidencia Moderada","index":8,"n_rows":61,"n_cols":15,"rows_kept":61,"cut":false,"hidden":false,"merged":[[46,5,46,8],[1,2,1,9],[3,3,3,4],[55,3,55,4],[51,2,52,2],[51,3,51,4],[51,9,52,9],[53,3,53,4],[53,2,54,2],[53,9,54,9],[37,2,39,2],[37,3,37,4],[40,2,42,2],[28,2,31,2],[28,3,28,4],[28,9,31,9],[32,2,34,2],[40,3,40,4],[40,9,42,9],[20,3,20,4],[20,2,23,2],[24,3,24,4],[32,3,32,4],[37,9,39,9],[35,2,36,2],[35,3,35,4],[35,9,36,9],[17,2,19,2],[32,9,34,9],[24,9,27,9],[17,3,17,4],[17,9,19,9],[20,9,23,9],[24,2,27,2],[5,2,8,2],[5,3,5,4],[5,9,8,9],[13,3,13,4],[9,2,12,2],[9,3,9,4],[9,9,12,9],[13,2,16,2],[13,9,16,9],[4,2,4,10],[56,3,56,4],[43,3,43,4],[43,9,45,9],[46,2,48,2],[46,3,46,4],[46,9,48,9],[49,2,50,2],[49,3,49,4],[49,9,50,9],[43,2,45,2]]}
[]
[null,null,"Implementação do Programa"]
[]
[null,null,"Elemento","Critérios",null,"N/A","Ausente","Presente mas não ideal","Presente e a funcionar bem","Média do elemento","Commentários (sew aplicável)","Absent","Present","Optimal","Average"]
[null,null,"Pacotes de prevenção do HIV para RAMJ em locais de incidência MODERADA"]
[null,null,"Perfil de avaliação de risco de HIV/ITS","Perfil de avaliação do risco de HIV/ITS oferecido:",null,null,null,null,null,{"$f":"IFERROR(O6,\"-\")","v":"-"},null,null,null,null,{"$f":"IFERROR(ROUND(AVERAGEIF(L7:N9,\"<>0\",L7:N9),0),\"-\")","v":"-"}]
[null,null,null,"○","Regularmente",null,null,null,null,null,null,{"$f":"IF(ISBLANK(G7),0,1)","v":0},{"$f":"IF(ISBLANK(H7),0,3)","v":0},{"$f":"IF(ISBLANK(I7),0,5)","v":0}]
[null,null,null,"○","Em todas as plataformas de saúde e baseadas na comunidade (pontos de prestação de serviços e unidades sanitárias)",null,null,null,null,null,null,0,0,0]
[null,null,null,null,"Utilizando financiamento de prevenção do HIV para RAMJ",null,null,null,null,null,null,0,0,0]
[null,null,"Aconselhamento e testagem para a redução do risco de HIV","Aconselhamento e testagem para a redução do risco de HIV oferecidos:",null,null,null,null,null,{"$f":"IFERROR(O10,\"-\")","v":"-"},null,null,null,null,{"$f":"IFERROR(ROUND(AVERAGEIF(L11:N13,\"<>0\",L11:N13),0),\"-\")","v":"-"}]
{"$rows_left_out":52}
{"sheet":"Alta Incidencia","index":9,"n_rows":79,"n_cols":15,"rows_kept":79,"cut":false,"hidden":false,"merged":[[1,2,1,9],[3,3,3,4],[5,2,8,2],[5,3,5,4],[5,9,8,9],[4,2,4,10],[28,2,32,2],[28,3,28,4],[28,9,32,9],[13,2,17,2],[13,3,13,4],[13,9,17,9],[18,2,22,2],[18,9,22,9],[9,2,12,2],[9,3,9,4],[9,9,12,9],[23,2,27,2],[23,3,23,4],[23,9,27,9],[18,3,18,4],[57,2,60,2],[57,3,57,4],[57,9,60,9],[41,2,43,2],[41,3,41,4],[41,9,43,9],[44,2,46,2],[44,3,44,4],[44,9,46,9],[47,2,49,2],[47,3,47,4],[47,9,49,9],[50,2,53,2],[50,3,50,4],[33,2,37,2],[38,2,40,2],[50,9,53,9],[54,2,56,2],[54,3,54,4],[54,9,56,9],[38,3,38,4],[38,9,40,9],[33,9,37,9],[33,3,33,4],[69,3,69,4],[70,3,70,4],[61,2,64,2],[61,3,61,4],[61,9,64,9],[65,2,68,2],[65,3,65,4],[65,9,68,9]]}
[]
[null,null,"Implementação do Programa"]
[]
[null,null,"Elemento","Critérios ",null,"N/A","Ausente","Presente mas não ideal","Presente e a funcionar bem","Média do elemento","Commentários (se aplicável)","Absent","Present","Optimal","Average"]
[null,null,"Pacotes de prevenção do HIV para RAMJ em locais de incidência ELEVADA"]
[null,null,"Perfil de avaliação de risco de HIV/ITS","Perfil de avaliação do risco de HIV/ITS oferecido: ",null,null,null,null,null,{"$f":"IFERROR(O6,\"-\")","v":"-"},null,null,null,null,{"$f":"IFERROR(ROUND(AVERAGEIF(L7:N9,\"<>0\",L7:N9),0),\"-\")","v":"-"}]
[null,null,null,"○","Regularmente",null,null,null,null,null,null,{"$f":"IF(ISBLANK(G7),0,1)","v":0},{"$f":"IF(ISBLANK(H7),0,3)","v":0},{"$f":"IF(ISBLANK(I7),0,5)","v":0}]
[null,null,null,"○","Em todas as plataformas de saúde e comunitárias (pontos de prestação de serviços e unidades sanitárias)",null,null,null,null,null,null,0,0,0]
[null,null,null,null,"Utilizando financiamento de prevenção do HIV para RAMJ",null,null,null,null,null,null,0,0,0]
[null,null,"Aconselhamento e testagem para a redução do risco de HIV","Aconselhamento e testagem para a redução do risco de HIV oferecidos:  ",null,null,null,null,null,{"$f":"IFERROR(O10,\"-\")","v":"-"},null,null,null,null,{"$f":"IFERROR(ROUND(AVERAGEIF(L11:N13,\"<>0\",L11:N13),0),\"-\")","v":"-"}]
{"$rows_left_out":70}
{"sheet":"Resultados do Programa","index":10,"n_rows":29,"n_cols":15,"rows_kept":29,"cut":false,"hidden":false,"merged":[[1,2,1,9],[3,3,3,4],[4,2,4,9],[6,2,6,4],[7,2,7,4],[8,2,8,4],[9,2,9,4],[15,2,15,4],[10,2,10,4],[11,2,11,4],[12,2,12,4],[13,2,13,4],[20,2,20,4],[22,2,22,4],[24,2,24,4],[16,2,16,4],[17,2,17,4],[18,2,18,4],[19,2,19,4],[21,2,21,4],[23,2,23,4]]}
[]
[null,null,"Resultados do Programa"]
[]
[null,null,"Elemento","Critérios",null,"N/A","Sem meta","Meta não alcançada ou no bom caminho","Meta alcançada ou no bom caminho","Média do elemento","Commentários (se aplicável)","Absent","Present","Optimal","Average"]
[null,null,"Resultados e indicadores"]
[null,null,"Indicadores chave"]
[null,null,"Número de novas infecções por HIV entre RAMJ ",null,null,null,null,null,null,{"$f":"IFERROR(O7,\"-\")","v":"-"},null,{"$f":"IF(ISBLANK(G7),0,1)","v":0},{"$f":"IF(ISBLANK(H7),0,3)","v":0},{"$f":"IF(ISBLANK(I7),0,5)","v":0},{"$f":"IFERROR(IF(ISBLANK(G7),ROUND(AVERAGEIF(L7:N7,\"<>0\",L7:N7),0),L7),\"-\")","v":"-"}]
[null,null,"Percentagem (estimativa) de RAMJ vivendo com HIV ",null,null,null,null,null,null,"-",null,0,0,0,{"$f":"IFERROR(IF(ISBLANK(G8),ROUND(AVERAGEIF(L8:N8,\"<>0\",L8:N8),0),L8),\"-\")","v":"-"}]
[null,null,"Percentagem de RAMJ vivendo com HIV e que testaram positivo para HIV ",null,null,null,null,null,null,{"$f":"IFERROR(O9,\"-\")","v":"-"},null,{"$f":"IF(ISBLANK(G9),0,1)","v":0},{"$f":"IF(ISBLANK(H9),0,3)","v":0},{"$f":"IF(ISBLANK(I9),0,5)","v":0},{"$f":"IFERROR(IF(ISBLANK(G9),ROUND(AVERAGEIF(L9:N9,\"<>0\",L9:N9),0),L9),\"-\")","v":"-"}]
[null,null,"Percentagem de parceiros do sexo masculino vivendo com HIV e em TARV com supressão virológica",null,null,null,null,null,null,"-",null,0,0,0,"-"]
{"$rows_left_out":20}
{"sheet":"Resumo da Pontuação","index":11,"n_rows":102,"n_cols":11,"rows_kept":102,"cut":false,"hidden":false,"merged":[[1,2,1,6],[8,3,9,3],[10,3,14,3],[2,3,7,3],[2,2,14,2],[79,2,95,2],[47,3,60,3],[61,3,78,3],[47,2,78,2],[79,3,85,3],[86,3,94,3],[15,2,46,2],[15,3,18,3],[19,3,20,3],[21,3,24,3],[25,3,27,3],[28,3,35,3],[37,3,38,3],[39,3,46,3]]}
[]
[null,null,"Resumo da Pontuação"]
[null,null,"Gestão do Programa","Liderança e coordenação",null,"Estratégia Nacional e Plano Estratégico\nAvaliação das necessidades",{"$f":"'Gestão do Programa'!O6","v":"-"}]
[null,null,null,null,null,"Planos Nacional, Provincial e Distrital",{"$f":"'Gestão do Programa'!O19","v":"-"}]
[null,null,null,null,null,"Grupo Técnico Nacional de Trabalho (GTT) para a Prevenção de RAMJ/Jovens",{"$f":"'Gestão do Programa'!O20","v":"-"}]
[null,null,null,null,null,"Prestação de contas",{"$f":"'Gestão do Programa'!O31","v":"-"}]
[null,null,null,null,null,"Plano de reforço da capacidade e assistência técnica",{"$f":"'Gestão do Programa'!O40","v":"-"}]
[null,null,null,null,null,"Plano de sustentabilidade e roteiro de transição",{"$f":"'Gestão do Programa'!O48","v":"-"}]
[null,null,null,"Estratégia, política e regulamento",null,"Políticas e leis",{"$f":"'Gestão do Programa'!O53","v":"-"}]
[null,null,null,null,null,"Directrizes",{"$f":"'Gestão do Programa'!O65","v":"-"}]
{"$rows_left_out":93}
{"sheet":"Próximos Passos","index":12,"n_rows":54,"n_cols":8,"rows_kept":54,"cut":false,"hidden":false,"merged":[[1,2,1,8],[11,2,11,3]]}
[]
[null,null,"Próximos Passos"]
[]
[null,null,null,null,null,"Elemento que precisa de atenção","Razão do fraco desempenho","Acções propostas (ex: apoio ou acções correctivas necessárias). Por favor, certifique-se de que as acções propostas sejam desagregadas, quando apropriado, por categoria de idade: 15-19; 20-24 e 25-29."]
[null,null,null,null,1,{"$f":"IFERROR(INDEX('Resumo da Pontuação'!$F$1:$F$97,SMALL(IF('Resumo da Pontuação'!$G$1:$G$97<=$C$12,ROW('Resumo da Pontuação'!$G$1:$G$97)),ROW(3:3))),\"\")","v":""}]
[null,null,null,null,2,{"$f":"IFERROR(INDEX('Resumo da Pontuação'!$F$1:$F$97,SMALL(IF('Resumo da Pontuação'!$G$1:$G$97<=$C$12,ROW('Resumo da Pontuação'!$G$1:$G$97)),ROW(4:4))),\"\")","v":""}]
[null,null,null,null,3,{"$f":"IFERROR(INDEX('Resumo da Pontuação'!$F$1:$F$97,SMALL(IF('Resumo da Pontuação'!$G$1:$G$97<=$C$12,ROW('Resumo da Pontuação'!$G$1:$G$97)),ROW(5:5))),\"\")","v":""}]
[null,null,null,null,4,{"$f":"IFERROR(INDEX('Resumo da Pontuação'!$F$1:$F$97,SMALL(IF('Resumo da Pontuação'!$G$1:$G$97<=$C$12,ROW('Resumo da Pontuação'!$G$1:$G$97)),ROW(6:6))),\"\")","v":""}]
[null,null,null,null,5,{"$f":"IFERROR(INDEX('Resumo da Pontuação'!$F$1:$F$97,SMALL(IF('Resumo da Pontuação'!$G$1:$G$97<=$C$12,ROW('Resumo da Pontuação'!$G$1:$G$97)),ROW(7:7))),\"\")","v":""}]
[null,null,null,null,6,{"$f":"IFERROR(INDEX('Resumo da Pontuação'!$F$1:$F$97,SMALL(IF('Resumo da Pontuação'!$G$1:$G$97<=$C$12,ROW('Resumo da Pontuação'!$G$1:$G$97)),ROW(8:8))),\"\")","v":""}]
{"$rows_left_out":45}
{"sheet":"Bibliografia","index":13,"n_rows":53,"n_cols":4,"rows_kept":53,"cut":false,"hidden":false,"merged":[[1,2,1,3]]}
[]
[null,null,"Bibliografia"]
[null,null,1,"Global Fund. (2018). Measurement framework for adolescent girls and young women"]
[null,null,2,"Global HIV Prevention Coalition (2020). Decision-making Aide for Investments into HIV Prevention Programmes among Adolescent Girls and Young Women "]
[null,null,3,"International AIDS Society. (2018). Differentiated service delivery for HIV: A decision framework for HIV testing services"]
[null,null,4,"International AIDS Society. (2018). Differentiated service delivery: A decision framework for differentiated antiretroviral therapy for key populations"]
[null,null,5,"Joint United Nations Programme on HIV/AIDS (UNAIDS). (2016). HIV prevention among adolescent girls and young women. Geneva, Switzerland"]
[null,null,6,"Joint United Nations Programme on HIV/AIDS. (2008). A framework for monitoring and evaluating HIV prevention programmes for most-at-risk populations. Geneva: UNAIDS"]
[null,null,7,"Joint United Nations Programme on HIV/AIDS. (2012). Key programmes to reduce stigma and discrimination and increase access to justice in national HIV responses. Guidance Note"]
[null,null,8,"Joint United Nations Programme on HIV/AIDS. (2016). HIV prevention among adolescent girls and young women: Putting HIV prevention among adolescent girls and young women on the fast-track and engaging men and boys"]
{"$rows_left_out":44}
{"sheet":"Acrónimos","index":14,"n_rows":36,"n_cols":4,"rows_kept":36,"cut":false,"hidden":false,"merged":[[1,2,1,3]]}
[]
[null,null,"Acrónimos"]
[null,null,"Raparigas adolescentes e mulheres jovens","RAMJ"]
[null,null,"Cuidados Pré-natais","CPN"]
[null,null,"Tratamento anti-retroviral","TARV"]
[null,null,"Educação sexual abrangente","CSE"]
[null,null,"Organizações da sociedade civil","OSC"]
[null,null,"Organizações de base comunitária","OBC"]
[null,null,"Sistema Distrital de Informação de Saúde","DHIS"]
[null,null,"Planeamento Familiar","PF"]
{"$rows_left_out":26}