{"text_format":"1","workbook":"xlsx","n_sheets":14,"sheets":["Introduction","Instructions","FAQs","Guidance for AGYW","Programme Management","Programme Implementation","ALL - Regardless of Incidence","MODERATE Incidence","HIGH Incidence","Programme Outcomes ","Summary of scores","Next steps ","Bibliography","Acronyms"],"not_rendered":{"charts":12,"images":1,"macros":1,"external_links":0,"defined_names":35,"comments":0,"pivot_tables":0},"unopened":[],"bounds":{"document_bytes":16777216,"sheet_cells":100000,"rows_first":2000,"rows_last":500,"rows_between":2000,"halvings":0,"cell_chars":16384,"cell_head_chars":4096},"cells_cut":0,"cells_raw":0,"read":"whole","date_system":"1900"}

{"sheet":"Introduction","index":0,"n_rows":2,"n_cols":3,"rows_kept":2,"cut":false,"hidden":false,"merged":[[1,2,1,22]]}
[]
[null,null,"What are the HIV Prevention Self-Assessment Tools (PSAT)?"]

{"sheet":"Instructions","index":1,"n_rows":57,"n_cols":19,"rows_kept":57,"cut":false,"hidden":false,"merged":[[2,2,2,17]]}
[]
[]
[null,null,"How to complete the Prevention Self Assessment Tool (PSAT)"]
[]
[]
[]
[]
[]
[]
[]
{"$rows_left_out":48}
{"sheet":"FAQs","index":2,"n_rows":2,"n_cols":3,"rows_kept":2,"cut":false,"hidden":false,"merged":[[1,2,1,22]]}
[]
[null,null,"Frequently Asked Questions"]

{"sheet":"Guidance for AGYW","index":3,"n_rows":2,"n_cols":3,"rows_kept":2,"cut":false,"hidden":false,"merged":[[1,2,1,22]]}
[]
[null,null,"Combination prevention for adolescent girls, young women and their male partners in high-prevalence locations"]

{"sheet":"Programme Management","index":4,"n_rows":90,"n_cols":16,"rows_kept":90,"cut":false,"hidden":false,"merged":[[1,2,1,9],[3,3,3,4],[4,2,4,10],[5,3,5,4],[5,5,5,8],[5,9,17,9],[18,3,18,4],[19,3,19,4],[19,5,19,8],[19,9,29,9],[30,3,30,4],[30,5,30,8],[30,9,37,9],[39,9,46,9],[64,9,73,9],[74,9,74,10],[75,3,75,4],[75,9,77,9],[80,9,81,9],[82,3,82,4],[82,5,82,8],[82,9,84,9],[47,9,50,9],[52,3,52,4],[52,6,52,8],[52,9,63,9],[64,3,64,4],[64,6,64,8],[75,2,77,2],[80,2,81,2],[82,2,84,2],[5,2,17,2],[19,2,29,2],[30,2,38,2],[39,2,46,2],[47,2,50,2],[52,2,63,2],[64,2,73,2]]}
[]
[null,null,"Programme Management"]
[]
[null,null,"Element","Criteria",null,"N/A","Absent","Present but not optimal","Present and working well","Average for element","Comments (if applicable)","Absent","Present","Optimal","Average","Sustainability Single Figure"]
[null,null,"Leadership and Coordination"]
[null,null,"National Strategy and Strategic Plan","There is a national strategy/policy and strategic plan in place for HIV Prevention amongst AGYW or they are well included in other HIV prevention plans and:",null,null,null,null,null,{"$f":"IFERROR(O6,\"-\")","v":"-"},null,null,null,null,{"$f":"IFERROR(ROUND(AVERAGEIF(L7:N18,\"<>0\",L7:N18),0),\"-\")","v":"-"}]
[null,null,null,"○","AGYW have been consulted in the development of HIV prevention strategies/plans for AGYW",null,null,null,null,null,null,{"$f":"IF(ISBLANK(G7),0,1)","v":0},{"$f":"IF(ISBLANK(H7),0,3)","v":0},{"$f":"IF(ISBLANK(I7),0,5)","v":0}]
[null,null,null,"○","The goals, objectives, and targets have been clearly defined and articulated for the HIV prevention programme among AGYW (and their male partners)",null,null,null,null,null,null,0,0,0]
[null,null,null,"○","HIV prevention programmes for AGYW recognise specific vulnerabilities of AGYWs due to gender, age, location, socio-economic status and educational status amongst others",null,null,null,null,null,null,0,0,0]
[null,null,null,"○","A clear logic model or theory of change is presented in the strategy/plan to guide HIV prevention programmes for AGYW",null,null,null,null,null,null,0,0,0]
{"$rows_left_out":81}
{"sheet":"Programme Implementation","index":5,"n_rows":237,"n_cols":16,"rows_kept":237,"cut":false,"hidden":false,"merged":[[107,9,116,9],[117,9,124,9],[125,9,132,9],[133,9,136,9],[195,9,200,9],[201,9,205,9],[206,9,211,9],[212,9,220,9],[15,9,19,9],[20,9,27,9],[29,9,32,9],[33,9,36,9],[38,9,47,9],[48,9,58,9],[59,9,63,9],[64,9,75,9],[78,9,82,9],[221,9,225,9],[226,9,229,9],[137,9,145,9],[146,9,149,9],[151,9,164,9],[166,9,169,9],[170,9,176,9],[178,9,187,9],[188,9,194,9],[137,2,145,2],[201,2,205,2],[206,2,211,2],[212,2,220,2],[221,2,225,2],[20,2,27,2],[29,2,32,2],[33,2,36,2],[38,2,47,2],[48,2,58,2],[59,2,63,2],[64,2,75,2],[93,2,101,2],[102,2,106,2],[226,2,229,2],[146,2,149,2],[151,2,164,2],[166,2,169,2],[170,2,176,2],[178,2,187,2],[188,2,194,2],[195,2,200,2],[64,3,64,4],[77,3,77,4],[78,3,78,4],[102,3,102,4],[107,3,107,4],[117,3,117,4],[125,3,125,4],[133,3,133,4],[137,3,137,4],[212,3,212,4],[221,3,221,4],[226,3,226,4],[107,2,116,2],[117,2,124,2],[125,2,132,2],[133,2,136,2],[107,5,107,8],[117,5,117,8],[125,5,125,8],[133,5,133,8],[137,5,137,8],[146,5,146,8],[201,3,201,4],[206,3,206,4],[146,3,146,4],[151,3,151,4],[166,3,166,4],[170,3,170,4],[178,3,178,4],[188,3,188,4],[195,3,195,4],[102,5,102,8],[78,5,78,8],[83,5,83,8],[78,2,82,2],[83,2,91,2],[83,3,83,4],[83,9,91,9],[93,5,93,8],[93,9,101,9],[93,3,93,4],[102,9,106,9],[33,3,33,4],[33,5,33,8],[38,3,38,4],[38,5,38,8],[1,2,1,9],[3,3,3,4],[5,2,10,2],[5,3,5,4],[5,5,5,8],[5,9,10,9],[11,5,11,8],[15,3,15,4],[20,3,20,4],[11,2,14,2],[11,3,11,4],[11,9,14,9],[15,2,19,2],[42,3,42,4],[42,5,42,8],[48,3,48,4],[48,5,48,8],[15,5,15,8],[20,5,20,8],[29,3,29,4],[29,5,29,8],[226,5,226,8],[151,5,151,8],[166,5,166,8],[170,5,170,8],[178,5,178,8],[28,2,28,4],[37,2,37,4],[59,3,59,4],[59,5,59,8],[64,5,64,8],[188,5,188,8],[195,5,195,8],[201,5,201,8],[206,5,206,8],[212,5,212,8],[221,5,221,8]]}
[]
[null,null,"Programme Implementation"]
[]
[null,null,"Element","Criteria",null,"N/A","Absent","Present but not optimal","Present and working well","Average for element","Comments (if applicable)","Absent","Present","Optimal","Average","Sustainability Single Figure"]
[null,null,"Targeting & planning"]
[null,null,"Demographic assessment & Disaggregation","National HIV Incidence data are available from appropriate sources & mathematical models (i.e. UNAIDS sub-national estimates)",null,null,null,null,null,{"$f":"IFERROR(O6,\"-\")","v":"-"},null,null,null,null,{"$f":"IFERROR(ROUND(AVERAGEIF(L7:N11,\"<>0\",L7:N11),0),\"-\")","v":"-"}]
[null,null,null,"○","Data are disaggregated by age, sex and location",null,null,null,null,null,null,{"$f":"IF(ISBLANK(G7),0,1)","v":0},{"$f":"IF(ISBLANK(H7),0,3)","v":0},{"$f":"IF(ISBLANK(I7),0,5)","v":0}]
[null,null,null,"○","Country-level incidence/transmission patterns are identified and analysed - including possible interactions between AGYW and other age groups of women/men",null,null,null,null,null,null,0,0,0]
[null,null,null,"○","The information is used to inform the need for service provision across health, education and community platforms",null,null,null,null,null,null,0,0,0]
[null,null,null,"○","This information is used for estimating funding requirements and target setting",null,null,null,null,null,null,0,0,0]
{"$rows_left_out":228}
{"sheet":"ALL - Regardless of Incidence","index":6,"n_rows":144,"n_cols":16,"rows_kept":144,"cut":false,"hidden":false,"merged":[[37,9,49,9],[50,9,67,9],[68,9,74,9],[75,9,86,9],[87,9,93,9],[75,3,75,4],[75,5,75,8],[87,3,87,4],[87,5,87,8],[55,3,55,4],[62,3,62,4],[62,5,62,8],[132,9,138,9],[139,9,140,9],[94,5,94,8],[100,5,100,8],[107,5,107,8],[116,5,116,8],[119,5,119,8],[119,9,131,9],[132,5,132,8],[100,9,106,9],[107,9,114,9],[116,9,118,9],[94,9,99,9],[1,2,1,9],[3,3,3,4],[4,2,4,10],[5,3,5,4],[5,5,5,8],[5,9,13,9],[14,3,14,4],[14,5,14,8],[14,9,30,9],[31,3,31,4],[31,5,31,8],[31,9,36,9],[37,5,37,8],[37,3,37,4],[44,3,44,4],[44,5,44,8],[50,3,50,4],[50,5,50,8],[100,2,106,2],[94,3,94,4],[68,3,68,4],[68,5,68,8],[107,2,115,2],[139,2,140,2],[5,2,13,2],[14,2,29,2],[31,2,35,2],[37,2,49,2],[50,2,67,2],[68,2,74,2],[75,2,85,2],[119,3,119,4],[132,3,132,4],[87,2,93,2],[94,2,98,2],[100,3,100,4],[107,3,107,4],[116,2,117,2],[119,2,130,2],[132,2,138,2],[116,3,116,4]]}
[]
[null,null,"Programme Implementation"]
[]
[null,null,"Element","Criteria",null,"N/A","Absent","Present but not optimal","Present and working well","Average for element","Comments (if applicable)","Absent","Present","Optimal","Average"]
[null,null,"National HIV Prevention Programme Enablers in ALL Locations"]
[null,null,"Access to primary and secondary education ","Efforts to increase access to education for AGYW have been successfully implemented and include: ",null,null,null,null,null,{"$f":"IFERROR(O6,\"-\")","v":"-"},null,null,null,null,{"$f":"IFERROR(ROUND(AVERAGEIF(L7:N14,\"<>0\",L7:N14),0),\"-\")","v":"-"}]
[null,null,null,"○","Making primary and secondary school compulsory",null,null,null,null,null,null,{"$f":"IF(ISBLANK(G7),0,1)","v":0},{"$f":"IF(ISBLANK(H7),0,3)","v":0},{"$f":"IF(ISBLANK(I7),0,5)","v":0}]
[null,null,null,"○","No-fee schooling or subsidies for poor families in countries where enrolment in school is low",null,null,null,null,null,null,0,0,0]
[null,null,null,"○","Building schools in rural locations to reduce travel distance for AGYW",null,null,null,null,null,null,0,0,0]
[null,null,null,"○","Access to school uniforms and feeding programmes ",null,null,null,null,null,null,0,0,0]
{"$rows_left_out":135}
{"sheet":"MODERATE Incidence","index":7,"n_rows":61,"n_cols":15,"rows_kept":61,"cut":false,"hidden":false,"merged":[[28,3,28,4],[32,3,32,4],[35,3,35,4],[20,3,20,4],[24,3,24,4],[20,2,23,2],[24,2,27,2],[28,2,31,2],[32,2,34,2],[35,2,36,2],[37,2,39,2],[40,2,42,2],[51,3,51,4],[53,3,53,4],[43,3,43,4],[43,2,45,2],[46,2,48,2],[49,2,50,2],[51,2,52,2],[53,2,54,2],[53,9,54,9],[55,3,55,4],[56,3,56,4],[46,3,46,4],[49,3,49,4],[1,2,1,9],[3,3,3,4],[4,2,4,10],[5,2,8,2],[5,3,5,4],[5,5,5,8],[5,9,8,9],[9,5,9,8],[9,2,12,2],[9,3,9,4],[9,9,12,9],[13,2,16,2],[13,3,13,4],[13,5,13,8],[17,2,19,2],[17,3,17,4],[37,3,37,4],[37,9,39,9],[40,9,42,9],[40,3,40,4],[43,9,45,9],[46,9,48,9],[49,9,50,9],[51,9,52,9],[13,9,16,9],[17,9,19,9],[20,9,23,9],[24,9,27,9],[28,9,31,9],[32,9,34,9],[35,9,36,9]]}
[]
[null,null,"Programme Implementation"]
[]
[null,null,"Element","Criteria",null,"N/A","Absent","Present but not optimal","Present and working well","Average for element","Comments (if applicable)","Absent","Present","Optimal","Average"]
[null,null,"HIV prevention packages for AGYW in MODERATE incidence locations"]
[null,null,"HIV/STI risk assessment profile","HIV/STI risk assessment profiling is offered: ",null,null,null,null,null,{"$f":"IFERROR(O6,\"-\")","v":"-"},null,null,null,null,{"$f":"IFERROR(ROUND(AVERAGEIF(L7:N9,\"<>0\",L7:N9),0),\"-\")","v":"-"}]
[null,null,null,"○","Routinely",null,null,null,null,null,null,{"$f":"IF(ISBLANK(G7),0,1)","v":0},{"$f":"IF(ISBLANK(H7),0,3)","v":0},{"$f":"IF(ISBLANK(I7),0,5)","v":0}]
[null,null,null,"○","At all health and community based platforms (service delivery points and facilities)",null,null,null,null,null,null,0,0,0]
[null,null,null,null,"Using HIV prevention funding for AGYW ",null,null,null,null,null,null,0,0,0]
[null,null,"HIV risk reduction counselling and testing","HIV risk reduction counselling and testing are offered:",null,null,null,null,null,{"$f":"IFERROR(O10,\"-\")","v":"-"},null,null,null,null,{"$f":"IFERROR(ROUND(AVERAGEIF(L11:N13,\"<>0\",L11:N13),0),\"-\")","v":"-"}]
{"$rows_left_out":52}
{"sheet":"HIGH Incidence","index":8,"n_rows":79,"n_cols":15,"rows_kept":79,"cut":false,"hidden":false,"merged":[[61,2,64,2],[65,2,68,2],[38,9,40,9],[41,3,41,4],[41,9,43,9],[47,2,49,2],[47,9,49,9],[38,3,38,4],[54,3,54,4],[9,2,12,2],[13,2,17,2],[18,2,22,2],[23,2,27,2],[50,2,53,2],[28,2,32,2],[33,2,37,2],[18,3,18,4],[9,3,9,4],[23,3,23,4],[54,2,56,2],[57,2,60,2],[54,9,56,9],[57,3,57,4],[57,9,60,9],[61,9,64,9],[61,3,61,4],[65,9,68,9],[69,3,69,4],[70,3,70,4],[65,3,65,4],[1,2,1,9],[3,3,3,4],[4,2,4,10],[5,3,5,4],[5,9,8,9],[5,2,8,2],[18,9,22,9],[9,9,12,9],[13,3,13,4],[13,9,17,9],[23,9,27,9],[28,3,28,4],[28,9,32,9],[50,9,53,9],[33,9,37,9],[38,2,40,2],[41,2,43,2],[44,2,46,2],[44,3,44,4],[44,9,46,9],[33,3,33,4],[47,3,47,4],[50,3,50,4]]}
[]
[null,null,"Programme Implementation"]
[]
[null,null,"Element","Criteria",null,"N/A","Absent","Present but not optimal","Present and working well","Average for element","Comments (if applicable)","Absent","Present","Optimal","Average"]
[null,null,"HIV prevention packages for AGYW in HIGH incidence locations"]
[null,null,"HIV/STI risk assessment profile","HIV/STI risk assessment profiling is offered: ",null,null,null,null,null,{"$f":"IFERROR(O6,\"-\")","v":"-"},null,null,null,null,{"$f":"IFERROR(ROUND(AVERAGEIF(L7:N9,\"<>0\",L7:N9),0),\"-\")","v":"-"}]
[null,null,null,"○","Routinely",null,null,null,null,null,null,{"$f":"IF(ISBLANK(G7),0,1)","v":0},{"$f":"IF(ISBLANK(H7),0,3)","v":0},{"$f":"IF(ISBLANK(I7),0,5)","v":0}]
[null,null,null,"○","At all health and community based platforms (service delivery points and facilities)",null,null,null,null,null,null,0,0,0]
[null,null,null,null,"Using HIV prevention funding for AGYW ",null,null,null,null,null,null,0,0,0]
[null,null,"HIV risk reduction counselling and testing","HIV risk reduction counselling and testing are offered:",null,null,null,null,null,{"$f":"IFERROR(O10,\"-\")","v":"-"},null,null,null,null,{"$f":"IFERROR(ROUND(AVERAGEIF(L11:N13,\"<>0\",L11:N13),0),\"-\")","v":"-"}]
{"$rows_left_out":70}
{"sheet":"Programme Outcomes ","index":9,"n_rows":28,"n_cols":15,"rows_kept":28,"cut":false,"hidden":false,"merged":[[1,2,1,9],[2,3,2,4],[3,2,3,9],[5,2,5,4],[6,2,6,4],[7,2,7,4],[8,2,8,4],[17,2,17,4],[18,2,18,4],[19,2,19,4],[20,2,20,4],[21,2,21,4],[22,2,22,4],[23,2,23,4],[9,2,9,4],[10,2,10,4],[11,2,11,4],[12,2,12,4],[14,2,14,4],[15,2,15,4],[16,2,16,4]]}
[]
[null,null,"Programme Outcomes"]
[null,null,"Element","Criteria",null,"N/A","No target","Target not met or not on track","Target met or on track","Average for element","Comments (if applicable)","Absent","Present","Optimal","Average"]
[null,null,"Outcomes and indicators"]
[null,null,"Key indicators"]
[null,null,"Number of new HIV infections amongst AGYW",null,null,null,null,null,null,{"$f":"IFERROR(O6,\"-\")","v":"-"},null,{"$f":"IF(ISBLANK(G6),0,1)","v":0},{"$f":"IF(ISBLANK(H6),0,3)","v":0},{"$f":"IF(ISBLANK(I6),0,5)","v":0},{"$f":"IFERROR(IF(ISBLANK(G6),ROUND(AVERAGEIF(L6:N6,\"<>0\",L6:N6),0),L6),\"-\")","v":"-"}]
[null,null,"Percentage of (estimated) AGYW living with HIV who know their status",null,null,null,null,null,null,"-",null,0,0,0,"-"]
[null,null,"Percentage of AGYW living with HIV and on ART who are virologically suppressed",null,null,null,null,null,null,"-",null,0,0,0,"-"]
[null,null,"Percentage of male partners living with HIV and on ART who are virologically suppressed",null,null,null,null,null,null,"-",null,0,0,0,"-"]
[null,null,"Percentage of priority districts (administrative areas) with dedicated programs for young women & male partners (full package) ",null,null,null,null,null,null,"-",null,0,0,0,"-"]
{"$rows_left_out":19}
{"sheet":"Summary of scores","index":10,"n_rows":104,"n_cols":10,"rows_kept":104,"cut":false,"hidden":false,"merged":[[39,3,46,3],[47,2,78,2],[47,3,60,3],[61,3,78,3],[79,2,97,2],[79,3,86,3],[87,3,96,3],[15,2,46,2],[15,3,18,3],[19,3,20,3],[21,3,24,3],[25,3,27,3],[28,3,35,3],[37,3,38,3],[1,2,1,5],[2,2,14,2],[2,3,7,3],[8,3,9,3],[10,3,14,3]]}
[]
[null,null,"Summary of scores"]
[null,null,"Programme Management","Leadership & coordination","National Strategy and Strategic Plan",{"$f":"'Programme Management'!O6","v":"-"}]
[null,null,null,null,"National and Sub-National plans",{"$f":"'Programme Management'!O19","v":"-"}]
[null,null,null,null,"National Technical working group (TWG) for AGYW/Youth Prevention",{"$f":"'Programme Management'!O20","v":"-"}]
[null,null,null,null,"Accountability",{"$f":"'Programme Management'!O31","v":"-"}]
[null,null,null,null,"Capacity building and technical assistance plan",{"$f":"'Programme Management'!O40","v":"-"}]
[null,null,null,null,"Sustainability plan and transition roadmap",{"$f":"'Programme Management'!O48","v":"-"}]
[null,null,null,"Strategy, Policy & regulation","Policies and Laws",{"$f":"'Programme Management'!O53","v":"-"}]
[null,null,null,null,"Guidelines",{"$f":"'Programme Management'!O65","v":"-"}]
{"$rows_left_out":95}
{"sheet":"Next steps ","index":11,"n_rows":55,"n_cols":8,"rows_kept":55,"cut":false,"hidden":false,"merged":[[1,2,1,8],[11,2,11,3]]}
[]
[null,null,"Next Steps"]
[]
[null,null,null,null,null,"Element that needs to be addressed","Reason for low performance","Proposed actions (e.g. support required or corrective actions). Please ensure that proposed actions are disaggregated, when appropriate, per age category: 15-19; 20-24 and 25-29"]
[null,null,null,null,1,{"$f":"IFERROR(INDEX('Summary of scores'!$E$1:$E$99,SMALL(IF('Summary of scores'!$F$1:$F$99<=$C$12,ROW('Summary of scores'!$F$1:$F$99)),ROW(3:3))),\"\")","v":""}]
[null,null,null,null,2,{"$f":"IFERROR(INDEX('Summary of scores'!$E$1:$E$99,SMALL(IF('Summary of scores'!$F$1:$F$99<=$C$12,ROW('Summary of scores'!$F$1:$F$99)),ROW(4:4))),\"\")","v":""}]
[null,null,null,null,3,{"$f":"IFERROR(INDEX('Summary of scores'!$E$1:$E$99,SMALL(IF('Summary of scores'!$F$1:$F$99<=$C$12,ROW('Summary of scores'!$F$1:$F$99)),ROW(5:5))),\"\")","v":""}]
[null,null,null,null,4,{"$f":"IFERROR(INDEX('Summary of scores'!$E$1:$E$99,SMALL(IF('Summary of scores'!$F$1:$F$99<=$C$12,ROW('Summary of scores'!$F$1:$F$99)),ROW(6:6))),\"\")","v":""}]
[null,null,null,null,5,{"$f":"IFERROR(INDEX('Summary of scores'!$E$1:$E$99,SMALL(IF('Summary of scores'!$F$1:$F$99<=$C$12,ROW('Summary of scores'!$F$1:$F$99)),ROW(7:7))),\"\")","v":""}]
[null,null,null,null,6,{"$f":"IFERROR(INDEX('Summary of scores'!$E$1:$E$99,SMALL(IF('Summary of scores'!$F$1:$F$99<=$C$12,ROW('Summary of scores'!$F$1:$F$99)),ROW(8:8))),\"\")","v":""}]
{"$rows_left_out":46}
{"sheet":"Bibliography","index":12,"n_rows":53,"n_cols":4,"rows_kept":53,"cut":false,"hidden":false,"merged":[[1,2,1,3]]}
[]
[null,null,"Bibliography"]
[null,null,1,"Global Fund. (2018). Measurement framework for adolescent girls and young women"]
[null,null,2,"Global HIV Prevention Coalition (2020). Decision-making Aide for Investments into HIV Prevention Programmes among Adolescent Girls and Young Women "]
[null,null,3,"International AIDS Society. (2018). Differentiated service delivery for HIV: A decision framework for HIV testing services"]
[null,null,4,"International AIDS Society. (2018). Differentiated service delivery: A decision framework for differentiated antiretroviral therapy for key populations"]
[null,null,5,"Joint United Nations Programme on HIV/AIDS (UNAIDS). (2016). HIV prevention among adolescent girls and young women. Geneva, Switzerland"]
[null,null,6,"Joint United Nations Programme on HIV/AIDS. (2008). A framework for monitoring and evaluating HIV prevention programmes for most-at-risk populations. Geneva: UNAIDS"]
[null,null,7,"Joint United Nations Programme on HIV/AIDS. (2012). Key programmes to reduce stigma and discrimination and increase access to justice in national HIV responses. Guidance Note"]
[null,null,8,"Joint United Nations Programme on HIV/AIDS. (2016). HIV prevention among adolescent girls and young women: Putting HIV prevention among adolescent girls and young women on the fast-track and engaging men and boys"]
{"$rows_left_out":44}
{"sheet":"Acronyms","index":13,"n_rows":36,"n_cols":4,"rows_kept":36,"cut":false,"hidden":false,"merged":[[1,2,1,3]]}
[]
[null,null,"Acronyms"]
[null,null,"Adolescent girls and young women ","AGYW"]
[null,null,"Antenatal care","ANC"]
[null,null,"Antiretroviral therapy","ART"]
[null,null,"Comprehensive sexuality education","CSE"]
[null,null,"Civil society organisations ","CSO"]
[null,null,"Community-based organisation","CBO"]
[null,null,"District health information software","DHIS"]
[null,null,"Family planning","FP"]
{"$rows_left_out":26}