{"text_format":"1","workbook":"xlsx","n_sheets":12,"sheets":["Summary of scores (2)","Introduction","Instructions","Foire aux questions","Conseils pour les préservatifs","Gestion de programme","Mise en œuvre de programme","Résultats de programme ","Résumé des notes","Étapes suivantes","Bibliographie","Acronymes"],"not_rendered":{"charts":6,"images":2,"macros":1,"external_links":0,"defined_names":28,"comments":1,"pivot_tables":0},"unopened":[],"bounds":{"document_bytes":16777216,"sheet_cells":100000,"rows_first":2000,"rows_last":500,"rows_between":2000,"halvings":0,"cell_chars":16384,"cell_head_chars":4096},"cells_cut":0,"cells_raw":0,"read":"whole","date_system":"1900"}

{"sheet":"Summary of scores (2)","index":0,"n_rows":142,"n_cols":6,"rows_kept":142,"cut":false,"hidden":true,"merged":[[109,2,141,2],[109,3,136,3],[137,3,141,3],[1,2,1,6],[68,2,74,2],[68,3,71,3],[72,3,73,3],[76,2,108,2],[93,3,97,3],[99,3,100,3],[101,3,108,3],[76,3,79,3],[80,3,82,3],[83,3,86,3],[87,3,89,3],[90,3,92,3],[74,3,75,3],[2,2,67,2],[2,3,23,3],[24,3,45,3],[46,3,67,3]]}
[]
[null,null,"Summary of scores"]
[null,null,"Prevention\nPackages","AGYW Prevention Package\n(HIGH Incidence Locations)",null,"Risk Assessment / Profiling"]
[null,null,null,null,null,"Male and female condoms and lubricants "]
[null,null,null,null,null,"HIV testing, treatment, counselling and support"]
[null,null,null,null,null,"Pre-exposure Prophylaxis"]
[null,null,null,null,null,"STI diagnosis & service integration"]
[null,null,null,null,null,"SRH services incl. contraceptive mix"]
[null,null,null,null,null,"GBV services, post-rape care "]
[null,null,null,null,null,"Antenatal care (ANC) including PMTCT"]
[null,null,null,null,null,"Clinical service package for sex partners of AGYW"]
[null,null,null,null,null,"Accessible services"]
[null,null,null,null,null,"Youth-friendly/Acceptable services"]
[null,null,null,null,null,"Sensitisation"]
[null,null,null,null,null,"School-based prevention campaigns"]
{"$rows_left_out":128}
{"sheet":"Introduction","index":1,"n_rows":2,"n_cols":3,"rows_kept":2,"cut":false,"hidden":false,"merged":[[1,2,1,22]]}
[]
[null,null,"Que sont les Outils d’auto-évaluation pour la prévention du VIH (OAEP) ?"]

{"sheet":"Instructions","index":2,"n_rows":57,"n_cols":19,"rows_kept":57,"cut":false,"hidden":false,"merged":[[2,2,2,17]]}
[]
[]
[null,null,"Comment compléter l’outil d’auto-évaluation pour la prévention (OAEP) ?"]
[]
[]
[]
[]
[]
[]
[]
[]
[]
[]
[]
[]
{"$rows_left_out":43}
{"sheet":"Foire aux questions","index":3,"n_rows":2,"n_cols":3,"rows_kept":2,"cut":false,"hidden":false,"merged":[[1,2,1,22]]}
[]
[null,null,"Foire aux questions"]

{"sheet":"Conseils pour les préservatifs","index":4,"n_rows":2,"n_cols":3,"rows_kept":2,"cut":false,"hidden":false,"merged":[[1,2,1,22]]}
[]
[null,null,"Programmes nationaux renforcés de changement des comportements en matière de préservatifs et de produits connexes"]

{"sheet":"Gestion de programme","index":5,"n_rows":91,"n_cols":16,"rows_kept":91,"cut":false,"hidden":false,"merged":[[37,2,41,2],[37,9,41,9],[42,2,46,2],[42,9,46,9],[1,2,1,9],[3,3,3,4],[5,2,16,2],[5,9,16,9],[17,2,18,2],[19,9,23,9],[24,2,29,2],[24,9,29,9],[30,2,35,2],[30,9,35,9],[19,2,23,2],[17,9,18,9],[47,2,51,2],[48,9,51,9],[52,2,56,2],[58,2,65,2],[58,9,65,9],[52,9,56,9],[67,9,76,9],[78,2,81,2],[78,9,81,9],[82,2,83,2],[84,2,86,2],[66,2,76,2],[82,9,83,9],[84,9,86,9]]}
[]
[null,null,"Gestion de programme"]
[]
[null,null,"Élément","Critères",null,"S/O","Absent","Présent mais non optimal","Présent et fonctionnel","Moyenne de l’élément","Commentaires (le cas échéant)","Absent","Present","Optimal","Average","Sustainability Single Figure"]
[null,null,"Leadership et capacité"]
[null,null,"Plan/Stratégie national(e)                 pour les préservatifs","○","Il existe un plan national pour les préservatifs ",null,null,null,null,{"$f":"IFERROR(O6,\"-\")","v":"-"},null,null,null,null,{"$f":"IFERROR(ROUND(AVERAGEIF(L7:N17,\"<>0\",L7:N17),0),\"-\")","v":"-"}]
[null,null,null,"○","Le Plan national pour les préservatifs est informé par  une analyse de la situation qui comprend une analyse globale du marché",null,null,null,null,null,null,{"$f":"IF(ISBLANK(G7),0,1)","v":0},{"$f":"IF(ISBLANK(H7),0,3)","v":0},{"$f":"IF(ISBLANK(I7),0,5)","v":0}]
[null,null,null,"○","Le Plan national pour les préservatifs comprend un Modèle logique / Théorie du changement / Cadre de résultats clairs qui relient les activités aux produits, aux résultats et aux objectifs",null,null,null,null,null,null,0,0,0]
[null,null,null,"○","Le Plan national de distribution de préservatifs identifie les populations prioritaires et justifie leur choix",null,null,null,null,null,null,0,0,0]
[null,null,null,"○","Le Plan national pour les préservatifs définit les obstacles/contraintes à l’utilisation de préservatifs",null,null,null,null,null,null,0,0,0]
[null,null,null,"○","Le Plan national pour les préservatifs définit des objectifs comportementaux pour les populations prioritaires qui tiennent compte de l’offre, de la demande et de la gestion du programme",null,null,null,null,null,null,0,0,0]
[null,null,null,"○","Le Plan national pour les préservatifs comprend des interventions hiérarchisées visant à éliminer les obstacles/contraintes identifiés",null,null,null,null,null,null,0,0,0]
[null,null,null,"○","Le Plan national pour les préservatifs est référencé dans le Plan national de lutte contre le VIH, la Stratégie de prévention du VIH et/ou la Stratégie de planification familiale",null,null,null,null,null,null,0,0,0]
[null,null,null,"○","Le Plan national pour les préservatifs oriente les décisions de financement",null,null,null,null,null,null,0,0,0]
[null,null,null,"○","Le Plan national pour les préservatifs est cité dans les demandes de financement (propositions, budgets) du gouvernement ou des partenaires de mise en œuvre",null,null,null,null,null,null,0,0,0]
{"$rows_left_out":77}
{"sheet":"Mise en œuvre de programme","index":6,"n_rows":38,"n_cols":16,"rows_kept":38,"cut":false,"hidden":false,"merged":[[7,2,8,2],[7,9,8,9],[1,2,1,9],[3,3,3,4],[5,2,6,2],[5,9,6,9],[11,2,13,2],[11,3,11,4],[11,9,13,9],[14,2,16,2],[14,3,14,4],[14,9,16,9],[14,5,14,8],[18,2,20,2],[18,3,18,4],[18,9,20,9],[21,3,21,4],[22,2,23,2],[22,9,23,9],[18,5,18,8],[27,2,28,2],[27,9,28,9],[24,3,24,4],[24,2,26,2],[24,9,26,9],[24,5,24,8]]}
[]
[null,null,"Mise en œuvre de programme"]
[]
[null,null,"Élément","Critères",null,"S/O","Absent","Présent mais non optimal","Présent et fonctionnel","Moyenne de l’élément","Commentaires (le cas échéant)","Absent","Present","Optimal","Average","Sustainability Single Figure"]
[null,null,"Intégration"]
[null,null,"Les activités de promotion et de distribution de préservatifs sont intégrées dans d'autres programmes de prévention du VIH, de planification familiale et de santé sexuelle et reproductive",null,"Les directives indiquent comment la promotion et la distribution de préservatifs peuvent/doivent être intégrées à la planification familiale, au traitement du VIH, aux autres formes de prévention et aux interventions ciblant les populations clés, les adolescentes et les jeunes femmes",null,null,null,null,{"$f":"IFERROR(O6,\"-\")","v":"-"},null,{"$f":"IF(ISBLANK(G6),0,1)","v":0},{"$f":"IF(ISBLANK(H6),0,3)","v":0},{"$f":"IF(ISBLANK(I6),0,5)","v":0},{"$f":"IFERROR(ROUND(AVERAGEIF(L6:N7,\"<>0\",L6:N7),0),\"-\")","v":"-"}]
[null,null,null,null,"Des procédures opérationnelles permanentes (ou l’équivalent) existent pour aider les prestataires, les agents de santé communautaires et les pairs-éducateurs des programmes de santé sexuelle et reproductive, de planification familiale, de traitement du VIH et d’autres programmes de prévention (adolescentes et jeunes femmes, populations clés, prophylaxie avant exposition, etc.) à intégrer des messages de programmation et de distribution de préservatifs dans leurs interventions",null,null,null,null,null,null,{"$f":"IF(ISBLANK(G7),0,1)","v":0},{"$f":"IF(ISBLANK(H7),0,3)","v":0},{"$f":"IF(ISBLANK(I7),0,5)","v":0}]
[null,null,"COVID -19",null,"Des programmes sont en place pour encourager et suivre l’utilisation du vaccin COVID-19 chez les usagers de préservatifs",null,null,null,null,{"$f":"IFERROR(O8,\"-\")","v":"-"},null,{"$f":"IF(ISBLANK(G8),0,1)","v":0},{"$f":"IF(ISBLANK(H8),0,3)","v":0},{"$f":"IF(ISBLANK(I8),0,5)","v":0},{"$f":"IFERROR(ROUND(AVERAGEIF(L8:N9,\"<>0\",L8:N9),0),\"-\")","v":"-"}]
[null,null,null,null,"Maintien de la messagerie et de l’accès sécurisé aux modèles de prestation de services hors établissement (ex. : communautaires, à domicile, de télésanté) pendant les pics de COVID-19 afin d’éviter toute interruption de service",null,null,null,null,null,null,{"$f":"IF(ISBLANK(G9),0,1)","v":0},{"$f":"IF(ISBLANK(H9),0,3)","v":0},{"$f":"IF(ISBLANK(I9),0,5)","v":0}]
[null,null,"Demande (axée sur les populations prioritaires telles qu’identifiées dans le plan national)"]
[null,null,"Données comportementales utilisées pour informer les activités de création de la demande",null,"Des données probantes promeuvent le changement comportemental, la création de demande et les interventions de communication",null,null,null,null,{"$f":"IFERROR(O11,\"-\")","v":"-"},null,{"$f":"IF(ISBLANK(G11),0,1)","v":0},{"$f":"IF(ISBLANK(H11),0,3)","v":0},{"$f":"IF(ISBLANK(I11),0,5)","v":0},{"$f":"IFERROR(ROUND(AVERAGEIF(L11:N11,\"<>0\",L11:N11),0),\"-\")","v":"-"}]
[null,null,"Stratégies de segmentation","Des stratégies de segmentation existent et :",null,null,null,null,null,{"$f":"IFERROR(O12,\"-\")","v":"-"},null,null,{"$f":"IF(ISBLANK(H12),0,3)","v":0},null,{"$f":"IFERROR(ROUND(AVERAGEIF(L13:N14,\"<>0\",L13:N14),0),\"-\")","v":"-"}]
[null,null,null,null,"Ciblent les interventions sur des publics divisés en groupes plus petits présentant des besoins, des préférences et des caractéristiques similaires",null,null,null,null,null,null,{"$f":"IF(ISBLANK(G13),0,1)","v":0},{"$f":"IF(ISBLANK(H13),0,3)","v":0},{"$f":"IF(ISBLANK(I13),0,5)","v":0}]
[null,null,null,null,"Orientent la conception de l’intervention et peuvent inclure une segmentation par groupe démographique, comportemental (populations adoptant des comportements à risque), psychographique ou autre",null,null,null,null,null,null,{"$f":"IF(ISBLANK(G14),0,1)","v":0},{"$f":"IF(ISBLANK(H14),0,3)","v":0},{"$f":"IF(ISBLANK(I14),0,5)","v":0}]
[null,null,"Directives sur la création de demande","Il existe des directives spécifiques pour donner la priorité aux investissements dans les interventions visant les populations prioritaires :",null,null,null,null,null,{"$f":"IFERROR(O15,\"-\")","v":"-"},null,null,null,null,{"$f":"IFERROR(ROUND(AVERAGEIF(L16:N17,\"<>0\",L16:N17),0),\"-\")","v":"-"}]
{"$rows_left_out":24}
{"sheet":"Résultats de programme ","index":7,"n_rows":23,"n_cols":15,"rows_kept":23,"cut":false,"hidden":false,"merged":[[17,2,17,4],[18,2,18,4],[8,2,8,4],[9,2,9,4],[15,2,15,4],[10,2,10,4],[11,2,11,4],[12,2,12,4],[13,2,13,4],[1,2,1,9],[3,3,3,4],[6,2,6,4],[7,2,7,4],[16,2,16,4]]}
[]
[null,null,"Résultats de programme"]
[]
[null,null,"Élément","Critères",null,"S/O","Pas d’objectif","Objectif non atteint ou non conforme aux prévisions","Objectif atteint ou en passe de l’être","Moyenne de l’élément","Commentaires (le cas échéant)","Absent","Present","Optimal","Average"]
[null,null,"Résultats et indicateurs"]
[null,null,"Indicateurs clés"]
[null,null,"Exposition de la population à risque aux activités de création de la demande/interventions comportementales",null,null,null,null,null,null,{"$f":"IFERROR(O7,\"-\")","v":"-"},null,{"$f":"IF(ISBLANK(G7),0,1)","v":0},{"$f":"IF(ISBLANK(H7),0,3)","v":0},{"$f":"IF(ISBLANK(I7),0,5)","v":0},{"$f":"IFERROR(IF(ISBLANK(G7),ROUND(AVERAGEIF(L7:N7,\"<>0\",L7:N7),0),L7),\"-\")","v":"-"}]
[null,null,"Pourcentage d’usagers déclarant que des préservatifs sont disponibles « quand et où j’en ai besoin »",null,null,null,null,null,null,{"$f":"IFERROR(O8,\"-\")","v":"-"},null,0,0,0,{"$f":"IFERROR(IF(ISBLANK(G8),ROUND(AVERAGEIF(L8:N8,\"<>0\",L8:N8),0),L8),\"-\")","v":"-"}]
[null,null,"Pourcentage de personnes ayant utilisé des préservatifs avec un partenaire non régulier au cours des douze derniers mois (hommes ; ventilé par âge)",null,null,null,null,null,null,"-",null,{"$f":"IF(ISBLANK(G9),0,1)","v":0},{"$f":"IF(ISBLANK(H9),0,3)","v":0},{"$f":"IF(ISBLANK(I9),0,5)","v":0},{"$f":"IFERROR(IF(ISBLANK(G9),ROUND(AVERAGEIF(L9:N9,\"<>0\",L9:N9),0),L9),\"-\")","v":"-"}]
[null,null,"Pourcentage de personnes ayant utilisé des préservatifs avec un partenaire non régulier au cours des douze derniers mois (femmes ; ventilé par âge)",null,null,null,null,null,null,"-",null,0,0,0,"-"]
[null,null,"Pourcentage d’hommes ayant utilisé un préservatif lors de leur dernier rapport anal avec un partenaire masculin non régulier",null,null,null,null,null,null,"-",null,0,0,0,"-"]
[null,null,"Pourcentage de travailleurs du sexe ayant utilisé un préservatif lors de leur dernier rapport sexuel avec un client",null,null,null,null,null,null,"-",null,0,0,0,"-"]
[null,null,"Pourcentage d’utilisation du préservatif lors du dernier rapport sexuel rémunéré (chez les hommes)",null,null,null,null,null,null,"-",null,0,0,0,"-"]
[null,null,"Pourcentage d’utilisation du préservatif lors de rapports sexuels prémaritaux (chez les hommes et les femmes de 15 à 24 ans) parmi ceux ayant déclaré avoir eu des rapports sexuels avant le mariage",null,null,null,null,null,null,"-",null,{"$f":"IF(ISBLANK(G14),0,1)","v":0},{"$f":"IF(ISBLANK(H14),0,3)","v":0},{"$f":"IF(ISBLANK(I14),0,5)","v":0},{"$f":"IFERROR(IF(ISBLANK(G14),ROUND(AVERAGEIF(L14:N14,\"<>0\",L14:N14),0),L14),\"-\")","v":"-"}]
[null,null,"Indicateurs complémentaires"]
{"$rows_left_out":9}
{"sheet":"Résumé des notes","index":8,"n_rows":46,"n_cols":11,"rows_kept":46,"cut":false,"hidden":false,"merged":[[27,2,39,2],[27,3,34,3],[35,3,38,3],[16,2,26,2],[17,3,19,3],[20,3,26,3],[1,2,1,6],[2,3,6,3],[2,2,15,2],[7,3,10,3],[11,3,12,3],[13,3,15,3]]}
[]
[null,null,"Résumé des notes"]
[null,null,"Gestion de programme","Leadership et capacité",null,"Plan/Stratégie national(e) pour les préservatifs",{"$f":"'Gestion de programme'!O6","v":"-"}]
[null,null,null,null,null,"Il existe une vision ou un plan pour un marché et un programme de préservatifs sains et durables ",{"$f":"'Gestion de programme'!O18","v":"-"}]
[null,null,null,null,null,"Leadership du gouvernement et coordination",{"$f":"'Gestion de programme'!O20","v":"-"}]
[null,null,null,null,null,"Capacité du gouvernement à gérer une approche globale du marché",{"$f":"'Gestion de programme'!O25","v":"-"}]
[null,null,null,null,null,"Coordination générale",{"$f":"'Gestion de programme'!O31","v":"-"}]
[null,null,null,"Politiques et réglementation",null,"Assurance qualité",{"$f":"'Gestion de programme'!O38","v":"-"}]
[null,null,null,null,null,"Politiques",{"$f":"'Gestion de programme'!O43","v":"-"}]
[null,null,null,null,null,"Environnement réglementaire et fiscal",{"$f":"'Gestion de programme'!O48","v":"-"}]
[null,null,null,null,null,"Directives ",{"$f":"'Gestion de programme'!O53","v":"-"}]
[null,null,null,"Analyse du programme",null,"Plan de suivi et d’évaluation",{"$f":"'Gestion de programme'!O59","v":"-"}]
[null,null,null,null,null,"Collecte, analyse, gestion et utilisation des données",{"$f":"'Gestion de programme'!O67","v":"-"}]
[null,null,null,"Financement",null,"Appui budgétaire",{"$f":"'Gestion de programme'!O79","v":"-"}]
[null,null,null,null,null,"Dépendance du marché à l’égard des subventions",{"$f":"'Gestion de programme'!O83","v":"-"}]
{"$rows_left_out":32}
{"sheet":"Étapes suivantes","index":9,"n_rows":54,"n_cols":8,"rows_kept":54,"cut":false,"hidden":false,"merged":[[1,2,1,8],[11,2,11,3]]}
[]
[null,null,"Étapes suivantes"]
[]
[null,null,null,null,null,"Élément à traiter/améliorer","Raison de la mauvaise performance","Actions proposées (ex. : soutien requis ou actions correctives)"]
[null,null,null,null,1,{"$f":"IFERROR(INDEX('Résumé des notes'!$F$1:$F$41,SMALL(IF('Résumé des notes'!$G$1:$G$41<=$C$12,ROW('Résumé des notes'!$G$1:$G$41)),ROW(3:3))),\"\")","v":""}]
[null,null,null,null,2,{"$f":"IFERROR(INDEX('Résumé des notes'!$F$1:$F$41,SMALL(IF('Résumé des notes'!$G$1:$G$41<=$C$12,ROW('Résumé des notes'!$G$1:$G$41)),ROW(4:4))),\"\")","v":""}]
[null,null,null,null,3,{"$f":"IFERROR(INDEX('Résumé des notes'!$F$1:$F$41,SMALL(IF('Résumé des notes'!$G$1:$G$41<=$C$12,ROW('Résumé des notes'!$G$1:$G$41)),ROW(5:5))),\"\")","v":""}]
[null,null,null,null,4,{"$f":"IFERROR(INDEX('Résumé des notes'!$F$1:$F$41,SMALL(IF('Résumé des notes'!$G$1:$G$41<=$C$12,ROW('Résumé des notes'!$G$1:$G$41)),ROW(6:6))),\"\")","v":""}]
[null,null,null,null,5,{"$f":"IFERROR(INDEX('Résumé des notes'!$F$1:$F$41,SMALL(IF('Résumé des notes'!$G$1:$G$41<=$C$12,ROW('Résumé des notes'!$G$1:$G$41)),ROW(7:7))),\"\")","v":""}]
[null,null,null,null,6,{"$f":"IFERROR(INDEX('Résumé des notes'!$F$1:$F$41,SMALL(IF('Résumé des notes'!$G$1:$G$41<=$C$12,ROW('Résumé des notes'!$G$1:$G$41)),ROW(8:8))),\"\")","v":""}]
[null,null,null,null,7,{"$f":"IFERROR(INDEX('Résumé des notes'!$F$1:$F$41,SMALL(IF('Résumé des notes'!$G$1:$G$41<=$C$12,ROW('Résumé des notes'!$G$1:$G$41)),ROW(9:9))),\"\")","v":""}]
[null,null,3,null,8,{"$f":"IFERROR(INDEX('Résumé des notes'!$F$1:$F$41,SMALL(IF('Résumé des notes'!$G$1:$G$41<=$C$12,ROW('Résumé des notes'!$G$1:$G$41)),ROW(10:10))),\"\")","v":""}]
[null,null,null,null,9,{"$f":"IFERROR(INDEX('Résumé des notes'!$F$1:$F$41,SMALL(IF('Résumé des notes'!$G$1:$G$41<=$C$12,ROW('Résumé des notes'!$G$1:$G$41)),ROW(11:11))),\"\")","v":""}]
[null,null,null,null,10,{"$f":"IFERROR(INDEX('Résumé des notes'!$F$1:$F$41,SMALL(IF('Résumé des notes'!$G$1:$G$41<=$C$12,ROW('Résumé des notes'!$G$1:$G$41)),ROW(12:12))),\"\")","v":""}]
[null,null,null,null,11,{"$f":"IFERROR(INDEX('Résumé des notes'!$F$1:$F$41,SMALL(IF('Résumé des notes'!$G$1:$G$41<=$C$12,ROW('Résumé des notes'!$G$1:$G$41)),ROW(13:13))),\"\")","v":""}]
{"$rows_left_out":40}
{"sheet":"Bibliographie","index":10,"n_rows":41,"n_cols":4,"rows_kept":41,"cut":false,"hidden":false,"merged":[[1,2,1,3]]}
[]
[null,null,"Bibliographie"]
[null,null,1," A Total Market Approach. PSI/UNFPA Joint Studies on the Total Market for Male Condoms in Six African Countries: Botswana, Pallin, S.C., D. Meekers, O. Lupu, K. Longfield, 2013"]
[null,null,2,"A Total Market Approach. PSI/UNFPA Joint Studies on the Total Market for Male Condoms in 6 African Countries: Uganda, Pallin, S.C., D. Meekers, O. Lupu, K. Longfield., 2013"]
[null,null,3,"A Total Market Approach. PSI/UNFPA Joint Studies on the Total Market for Male Condoms in Six African Countries: South Africa, Pallin, S.C., D. Meekers, O. Lupu, K. Longfield., 2013"]
[null,null,4,"A Total Market Approach. PSI/UNFPA Joint Studies on the Total Market for Male Condoms in Six African Countries: Swaziland, Pallin, S.C., D. Meekers, O. Lupu, K. Longfield., 2013"]
[null,null,5,"Challenges and Recommendations for reaching Fast-Track targets for condom use, UNAIDS, 2019"]
[null,null,6,"Comprehensive Condom Programming: A guide to resource mobilization and country programming, UNFPA, 2010"]
[null,null,7,"Comprehensive Condom Programming: A guide for resource mobilization and country programming, UNFPA, 2010"]
[null,null,8,"Condom and lubricant programming in high HIV prevalence countries, UNAIDS, 2014"]
[null,null,9,"Condom Market Landscaping Case Study: Botswana, Mann Global Health, 2017"]
[null,null,10,"Condom Market Landscaping Case Study: Kenya, Mann Global Health, 2017"]
[null,null,11,"Condom Market Landscaping Case Study: Tanzania, Mann Global Health, 2017"]
[null,null,12,"Condom Market Landscaping Case Study: Zambia, Mann Global Health, 2017"]
[null,null,13,"Condom Market Landscaping Case Study: Zimbabwe, Mann Global Health, 2017"]
{"$rows_left_out":27}
{"sheet":"Acronymes","index":11,"n_rows":25,"n_cols":4,"rows_kept":25,"cut":false,"hidden":false,"merged":[[1,2,1,3]]}
[]
[null,null,"Acronymes"]
[null,null,"AGM","Analyse globale du marché"]
[null,null,"BCCR","Bien de consommation à circulation rapide "]
[null,null,"Cadre S&E","Cadre de suivi et d’évaluation "]
[null,null,"C-NET","Outil d’estimation des besoins et des ressources en préservatifs de l’ONUSIDA"]
[null,null,"GTT","Groupe de travail / Groupe de travail technique "]
[null,null,"HSH","Hommes ayant rapports sexuels avec des hommes "]
[null,null,"M/F","Masculin/Féminin"]
[null,null,"MD","Marché durable des préservatifs / Marché durable "]
[null,null,"MdS","Ministère de la santé "]
[null,null,"MS","Marketing social"]
[null,null,"NE","Niveau d’effort"]
[null,null,"ONG","Organisation non-gouvernementale"]
[null,null,"PC","Populations clés"]
{"$rows_left_out":10}