{"text_format":"1","workbook":"xlsx","n_sheets":12,"sheets":["Summary of scores (2)","Introduction","Instructions ","FAQs","Guidance for condoms","Programme Management","Programme Implementation","Programme Outcomes ","Summary of scores","Next steps","Bibliography","Acronyms"],"not_rendered":{"charts":6,"images":1,"macros":1,"external_links":0,"defined_names":27,"comments":1,"pivot_tables":0},"unopened":[],"bounds":{"document_bytes":16777216,"sheet_cells":100000,"rows_first":2000,"rows_last":500,"rows_between":2000,"halvings":0,"cell_chars":16384,"cell_head_chars":4096},"cells_cut":0,"cells_raw":0,"read":"whole","date_system":"1900"}

{"sheet":"Summary of scores (2)","index":0,"n_rows":142,"n_cols":6,"rows_kept":142,"cut":false,"hidden":true,"merged":[[109,2,141,2],[109,3,136,3],[137,3,141,3],[1,2,1,6],[68,2,74,2],[68,3,71,3],[72,3,73,3],[76,2,108,2],[93,3,97,3],[99,3,100,3],[101,3,108,3],[76,3,79,3],[80,3,82,3],[83,3,86,3],[87,3,89,3],[90,3,92,3],[74,3,75,3],[2,2,67,2],[2,3,23,3],[24,3,45,3],[46,3,67,3]]}
[]
[null,null,"Summary of scores"]
[null,null,"Prevention\nPackages","AGYW Prevention Package\n(HIGH Incidence Locations)",null,"Risk Assessment / Profiling"]
[null,null,null,null,null,"Male and female condoms and lubricants "]
[null,null,null,null,null,"HIV testing, treatment, counselling and support"]
[null,null,null,null,null,"Pre-exposure Prophylaxis"]
[null,null,null,null,null,"STI diagnosis & service integration"]
[null,null,null,null,null,"SRH services incl. contraceptive mix"]
[null,null,null,null,null,"GBV services, post-rape care "]
[null,null,null,null,null,"Antenatal care (ANC) including PMTCT"]
[null,null,null,null,null,"Clinical service package for sex partners of AGYW"]
[null,null,null,null,null,"Accessible services"]
[null,null,null,null,null,"Youth-friendly/Acceptable services"]
[null,null,null,null,null,"Sensitisation"]
[null,null,null,null,null,"School-based prevention campaigns"]
[null,null,null,null,null,"Comprehensive sexuality education"]
[null,null,null,null,null,"Keeping girls in school"]
[null,null,null,null,null,"Community Mobilisation & demand generation"]
[null,null,null,null,null,"Increasing access to justice (policy and legal) "]
[null,null,null,null,null,"Gender-based violence prevention and management "]
{"$rows_left_out":123}
{"sheet":"Introduction","index":1,"n_rows":2,"n_cols":3,"rows_kept":2,"cut":false,"hidden":false,"merged":[[1,2,1,22]]}
[]
[null,null,"What are the HIV Prevention Self-Assessment Tools (PSAT)?"]

{"sheet":"Instructions ","index":2,"n_rows":3,"n_cols":3,"rows_kept":3,"cut":false,"hidden":false,"merged":[[2,2,2,17]]}
[]
[]
[null,null,"How to complete the PSAT"]

{"sheet":"FAQs","index":3,"n_rows":2,"n_cols":3,"rows_kept":2,"cut":false,"hidden":false,"merged":[[1,2,1,22]]}
[]
[null,null,"Frequently Asked Questions"]

{"sheet":"Guidance for condoms","index":4,"n_rows":2,"n_cols":3,"rows_kept":2,"cut":false,"hidden":false,"merged":[[1,2,1,22]]}
[]
[null,null,"Strengthened national condom and related behavioural change programmes"]

{"sheet":"Programme Management","index":5,"n_rows":91,"n_cols":16,"rows_kept":91,"cut":false,"hidden":false,"merged":[[37,2,41,2],[37,9,41,9],[42,2,46,2],[42,9,46,9],[1,2,1,9],[3,3,3,4],[5,2,16,2],[5,9,16,9],[17,2,18,2],[19,9,23,9],[24,2,29,2],[24,9,29,9],[30,2,35,2],[30,9,35,9],[19,2,23,2],[17,9,18,9],[47,2,51,2],[48,9,51,9],[52,2,56,2],[58,2,65,2],[58,9,65,9],[52,9,56,9],[67,9,76,9],[78,2,81,2],[78,9,81,9],[82,2,83,2],[84,2,86,2],[66,2,76,2],[82,9,83,9],[84,9,86,9]]}
[]
[null,null,"Programme Management"]
[]
[null,null,"Element","Criteria",null,"N/A","Absent","Present but not optimal","Present and working well","Average for element","Comments (if applicable)","Absent","Present","Optimal","Average","Sustainability Single Figure"]
[null,null,"Leadership and capacity"]
[null,null,"National condom plan/strategy","○","A National Condom Plan exists ",null,null,null,null,{"$f":"IFERROR(O6,\"-\")","v":"-"},null,null,null,null,{"$f":"IFERROR(ROUND(AVERAGEIF(L7:N17,\"<>0\",L7:N17),0),\"-\")","v":"-"}]
[null,null,null,"○","The National Condom Plan has been informed by a situation analysis that includes a total market analysis",null,null,null,null,null,null,{"$f":"IF(ISBLANK(G7),0,1)","v":0},{"$f":"IF(ISBLANK(H7),0,3)","v":0},{"$f":"IF(ISBLANK(I7),0,5)","v":0}]
[null,null,null,"○","The National Condom Plan  includes a clear Logic Model / Theory of Change / Results Framework that links activities to outputs, outcomes, and goals",null,null,null,null,null,null,0,0,0]
[null,null,null,"○","The National Condom Plan identifies priority populations and provides rationale for their selection",null,null,null,null,null,null,0,0,0]
[null,null,null,"○","National Condom Plan defines barriers  /constraints to condom use",null,null,null,null,null,null,0,0,0]
[null,null,null,"○","National Condom Plan defines behavioural objectives for priority populations that factor in supply, demand, and program stewardship",null,null,null,null,null,null,0,0,0]
[null,null,null,"○","National Condom Plan includes prioritised interventions to address identified barriers/constraints",null,null,null,null,null,null,0,0,0]
[null,null,null,"○","The National Condom Plan is referenced in the National HIV plan, the HIV Prevention strategy, and / or Family Planning strategy",null,null,null,null,null,null,0,0,0]
[null,null,null,"○","The National Condom Plan drives funding decisions",null,null,null,null,null,null,0,0,0]
[null,null,null,"○","National Condom Plan cited in funding requests (proposals, budgets) by government or implementing partners",null,null,null,null,null,null,0,0,0]
[null,null,null,"○","Operational plan (workplan with timelines, identified responsibilities and accountably) for National Condom Plan exists",null,null,null,null,null,null,0,0,0]
[null,null,null,"○","The operational plan is updated on a regular basis (status of actions recorded, timelines adjusted)",null,null,null,null,null,null,{"$f":"IF(ISBLANK(G17),0,1)","v":0},{"$f":"IF(ISBLANK(H17),0,3)","v":0},{"$f":"IF(ISBLANK(I17),0,5)","v":0}]
[null,null,"Government Capacity to manage to a Total Market Approach","○","The government understands its role in stewarding a Total Market Approach, and recognises the relative contribution of partners and sectors",null,null,null,null,{"$f":"IFERROR(O18,\"-\")","v":"-"},null,null,null,null,{"$f":"IFERROR(ROUND(AVERAGEIF(L18:N19,\"<>0\",L18:N19),0),\"-\")","v":"-"}]
[null,null,null,"○","The government has the capacity - including the human resources, experience and tools - relevant to managing a cross-sector approach supporting a Total Market Approach",null,null,null,null,null,null,{"$f":"IF(ISBLANK(G19),0,1)","v":0},{"$f":"IF(ISBLANK(H19),0,3)","v":0},{"$f":"IF(ISBLANK(I19),0,5)","v":0}]
[null,null,"Vision or plan for a healthy, sustainable condom market and programme exists \n","○","The National Condom Plan includes a clear vision or plan for a sustainable condom market that embraces a total market approach",null,null,null,null,{"$f":"IFERROR(O20,\"-\")","v":"-"},null,null,null,null,{"$f":"IFERROR(ROUND(AVERAGEIF(L21:N24,\"<>0\",L21:N24),0),\"-\")","v":"-"}]
{"$rows_left_out":72}
{"sheet":"Programme Implementation","index":6,"n_rows":38,"n_cols":16,"rows_kept":38,"cut":false,"hidden":false,"merged":[[7,2,8,2],[7,9,8,9],[1,2,1,9],[3,3,3,4],[5,2,6,2],[5,9,6,9],[11,2,13,2],[11,3,11,4],[11,9,13,9],[14,2,16,2],[14,3,14,4],[14,9,16,9],[14,5,14,8],[18,2,20,2],[18,3,18,4],[18,9,20,9],[21,3,21,4],[22,2,23,2],[22,9,23,9],[18,5,18,8],[27,2,28,2],[27,9,28,9],[24,3,24,4],[24,2,26,2],[24,9,26,9],[24,5,24,8]]}
[]
[null,null,"Programme Implementation"]
[]
[null,null,"Element","Criteria",null,"N/A","Absent","Present but not optimal","Present and working well","Average for element","Comments (if applicable)","Absent","Present","Optimal","Average","Sustainability Single Figure"]
[null,null,"Integration"]
[null,null,"Condom promotion and distribution activities are integrated into other HIV prevention, family planning and sexual and reproductive health programmes","○","Guidance outlines how condom promotion and distribution can / should be integrated into Family Planning, HIV treatment, other prevention, and interventions targeting Key Population and Adolescent Girls and Young Women",null,null,null,null,{"$f":"IFERROR(O6,\"-\")","v":"-"},null,{"$f":"IF(ISBLANK(G6),0,1)","v":0},{"$f":"IF(ISBLANK(H6),0,3)","v":0},{"$f":"IF(ISBLANK(I6),0,5)","v":0},{"$f":"IFERROR(ROUND(AVERAGEIF(L6:N7,\"<>0\",L6:N7),0),\"-\")","v":"-"}]
[null,null,null,"○","Standard Operating Procedures(or equivalent) exist supporting providers / Community Health Workers / peer educators from Sexual Reproductive Health/ Family Planning/ HIV treatment/ other prevention (Adolescent Girls and Young Women, Key Population, Pre-exposure prophylaxis, etc.) programs to incorporate condom programming messages and distribution into their interventions",null,null,null,null,null,null,{"$f":"IF(ISBLANK(G7),0,1)","v":0},{"$f":"IF(ISBLANK(H7),0,3)","v":0},{"$f":"IF(ISBLANK(I7),0,5)","v":0}]
[null,null,"COVID 19","○","Programs  are in place to encourage and track COVID-19 vaccine uptake among condom users",null,null,null,null,{"$f":"IFERROR(O8,\"-\")","v":"-"},null,{"$f":"IF(ISBLANK(G8),0,1)","v":0},{"$f":"IF(ISBLANK(H8),0,3)","v":0},{"$f":"IF(ISBLANK(I8),0,5)","v":0},{"$f":"IFERROR(ROUND(AVERAGEIF(L8:N9,\"<>0\",L8:N9),0),\"-\")","v":"-"}]
[null,null,null,"○","Continued messaging and safe access to non-facility-based service delivery models (e.g. community-based, home-based, telehealth) during COVID-19 peaks to avoid service disruption",null,null,null,null,null,null,{"$f":"IF(ISBLANK(G9),0,1)","v":0},{"$f":"IF(ISBLANK(H9),0,3)","v":0},{"$f":"IF(ISBLANK(I9),0,5)","v":0}]
[null,null,"Demand (focus on priority populations as identified in national plan)"]
[null,null,"Behavioural data used to inform demand creation activities","○","Evidence drives behaviour change / demand generation / communication interventions",null,null,null,null,{"$f":"IFERROR(O11,\"-\")","v":"-"},null,{"$f":"IF(ISBLANK(G11),0,1)","v":0},{"$f":"IF(ISBLANK(H11),0,3)","v":0},{"$f":"IF(ISBLANK(I11),0,5)","v":0},{"$f":"IFERROR(ROUND(AVERAGEIF(L11:N11,\"<>0\",L11:N11),0),\"-\")","v":"-"}]
[null,null,"Segmentation strategies","Segmentation strategies exist and:",null,null,null,null,null,{"$f":"IFERROR(O12,\"-\")","v":"-"},null,null,null,null,{"$f":"IFERROR(ROUND(AVERAGEIF(L13:N14,\"<>0\",L13:N14),0),\"-\")","v":"-"}]
[null,null,null,"○","Target interventions to audiences divided into smaller groups with similar needs, preferences and characteristics",null,null,null,null,null,null,{"$f":"IF(ISBLANK(G13),0,1)","v":0},{"$f":"IF(ISBLANK(H13),0,3)","v":0},{"$f":"IF(ISBLANK(I13),0,5)","v":0}]
[null,null,null,"○","Drive intervention design and may include a segmentation by demographic, behaviour (populations engaging in risk behaviours), psychographic, or other population groupings",null,null,null,null,null,null,{"$f":"IF(ISBLANK(G14),0,1)","v":0},{"$f":"IF(ISBLANK(H14),0,3)","v":0},{"$f":"IF(ISBLANK(I14),0,5)","v":0}]
[null,null,"Demand creation guidance","Specific guidance exists to prioritise investments in interventions reaching prioritised populations:",null,null,null,null,null,{"$f":"IFERROR(O15,\"-\")","v":"-"},null,null,null,null,{"$f":"IFERROR(ROUND(AVERAGEIF(L16:N17,\"<>0\",L16:N17),0),\"-\")","v":"-"}]
[null,null,null,"○","Existence of standard operating procedures drives condom promotion, outreach and distribution for front line workers",null,null,null,null,null,null,{"$f":"IF(ISBLANK(G16),0,1)","v":0},{"$f":"IF(ISBLANK(H16),0,3)","v":0},{"$f":"IF(ISBLANK(I16),0,5)","v":0}]
[null,null,null,"○","Communication strategies / guidance / plan exists",null,null,null,null,null,null,{"$f":"IF(ISBLANK(G17),0,1)","v":0},{"$f":"IF(ISBLANK(H17),0,3)","v":0},{"$f":"IF(ISBLANK(I17),0,5)","v":0}]
[null,null,"Supply"]
[null,null,"Quantification of universe of need","Total condom needs in the country have been quantified and analysed against existing condom use using the United Nations Programme on HIV/AIDS UNAIDS Condom Needs and Resource Requirement Estimation Tool C-NET:",null,null,null,null,null,{"$f":"IFERROR(O19,\"-\")","v":"-"},null,null,null,null,{"$f":"IFERROR(ROUND(AVERAGEIF(L20:N21,\"<>0\",L20:N21),0),\"-\")","v":"-"}]
[null,null,null,"○","The difference between need, consumption and supply is understood, analysed by priority population, and a informs national plans",null,null,null,null,null,null,{"$f":"IF(ISBLANK(G20),0,1)","v":0},{"$f":"IF(ISBLANK(H20),0,3)","v":0},{"$f":"IF(ISBLANK(I20),0,5)","v":0}]
{"$rows_left_out":19}
{"sheet":"Programme Outcomes ","index":7,"n_rows":23,"n_cols":15,"rows_kept":23,"cut":false,"hidden":false,"merged":[[17,2,17,4],[18,2,18,4],[8,2,8,4],[9,2,9,4],[15,2,15,4],[10,2,10,4],[11,2,11,4],[12,2,12,4],[13,2,13,4],[1,2,1,9],[3,3,3,4],[6,2,6,4],[7,2,7,4],[16,2,16,4]]}
[]
[null,null,"Programme Outcomes"]
[]
[null,null,"Element","Criteria",null,"N/A","No target","Target not met or not on track","Target met or on track","Average for element","Comments (if applicable)","Absent","Present","Optimal","Average"]
[null,null,"Outcomes and indicators"]
[null,null,"Key Indicators"]
[null,null,"At risk population exposure to demand creation activities/behavioural interventions",null,null,null,null,null,null,{"$f":"IFERROR(O7,\"-\")","v":"-"},null,{"$f":"IF(ISBLANK(G7),0,1)","v":0},{"$f":"IF(ISBLANK(H7),0,3)","v":0},{"$f":"IF(ISBLANK(I7),0,5)","v":0},{"$f":"IFERROR(IF(ISBLANK(G7),ROUND(AVERAGEIF(L7:N7,\"<>0\",L7:N7),0),L7),\"-\")","v":"-"}]
[null,null,"% of users that report condoms are available 'when and where I need them",null,null,null,null,null,null,{"$f":"IFERROR(O8,\"-\")","v":"-"},null,0,0,0,{"$f":"IFERROR(IF(ISBLANK(G8),ROUND(AVERAGEIF(L8:N8,\"<>0\",L8:N8),0),L8),\"-\")","v":"-"}]
[null,null,"% of people who used condoms with a non-regular partner in the last 12 months\n (men; disaggregated by age)",null,null,null,null,null,null,"-",null,{"$f":"IF(ISBLANK(G9),0,1)","v":0},{"$f":"IF(ISBLANK(H9),0,3)","v":0},{"$f":"IF(ISBLANK(I9),0,5)","v":0},{"$f":"IFERROR(IF(ISBLANK(G9),ROUND(AVERAGEIF(L9:N9,\"<>0\",L9:N9),0),L9),\"-\")","v":"-"}]
[null,null,"% of people who used condoms with a non-regular partner in the last 12 months \n(women; disaggregated by age)",null,null,null,null,null,null,"-",null,0,0,0,"-"]
[null,null,"% of men who used a condom the last time they had anal sex with a non-regular male partner",null,null,null,null,null,null,"-",null,0,0,0,"-"]
[null,null,"% of sex workers who used a condom the last time they had sex with a client",null,null,null,null,null,null,"-",null,0,0,0,"-"]
[null,null,"% Condom use at last paid sexual intercourse (among men)",null,null,null,null,null,null,"-",null,0,0,0,"-"]
[null,null,"% Condom use during premarital sex (among men and women 15-24) of those that report premarital sex",null,null,null,null,null,null,"-",null,{"$f":"IF(ISBLANK(G14),0,1)","v":0},{"$f":"IF(ISBLANK(H14),0,3)","v":0},{"$f":"IF(ISBLANK(I14),0,5)","v":0},{"$f":"IFERROR(IF(ISBLANK(G14),ROUND(AVERAGEIF(L14:N14,\"<>0\",L14:N14),0),L14),\"-\")","v":"-"}]
[null,null,"Supplementary indicators"]
[null,null,"Total number of condoms distributed during the reporting period, disaggregated by sector",null,null,null,null,null,null,"-",null,0,0,0,{"$f":"IFERROR(IF(ISBLANK(G16),ROUND(AVERAGEIF(L16:N16,\"<>0\",L16:N16),0),L16),\"-\")","v":"-"}]
[null,null,"Number of public sector sites reporting stock out of condoms in the past 12 months",null,null,null,null,null,null,"-",null,{"$f":"IF(ISBLANK(G17),0,1)","v":0},{"$f":"IF(ISBLANK(H17),0,3)","v":0},{"$f":"IF(ISBLANK(I17),0,5)","v":0},{"$f":"IFERROR(IF(ISBLANK(G17),ROUND(AVERAGEIF(L17:N17,\"<>0\",L17:N17),0),L17),\"-\")","v":"-"}]
[null,null,"Coverage: % of appropriate outlets (i.e., delivery points across sectors) that carry condoms",null,null,null,null,null,null,"-",null,{"$f":"IF(ISBLANK(G18),0,1)","v":0},{"$f":"IF(ISBLANK(H18),0,3)","v":0},{"$f":"IF(ISBLANK(I18),0,5)","v":0},{"$f":"IFERROR(IF(ISBLANK(G18),ROUND(AVERAGEIF(L18:N18,\"<>0\",L18:N18),0),L18),\"-\")","v":"-"}]
[null,null,"Equitable condom use: No more than 10% differential between percentage population in wealthiest two quintiles who report using condoms and those in the poorest two quintiles",null,null,null,null,null,null,"-",null,{"$f":"IF(ISBLANK(G19),0,1)","v":0},{"$f":"IF(ISBLANK(H19),0,3)","v":0},{"$f":"IF(ISBLANK(I19),0,5)","v":0},{"$f":"IFERROR(IF(ISBLANK(G19),ROUND(AVERAGEIF(L19:N19,\"<>0\",L19:N19),0),L19),\"-\")","v":"-"}]
[]
{"$rows_left_out":4}
{"sheet":"Summary of scores","index":8,"n_rows":46,"n_cols":11,"rows_kept":46,"cut":false,"hidden":false,"merged":[[27,2,39,2],[27,3,34,3],[35,3,38,3],[16,2,26,2],[17,3,19,3],[20,3,26,3],[1,2,1,6],[2,3,6,3],[2,2,15,2],[7,3,10,3],[11,3,12,3],[13,3,15,3]]}
[]
[null,null,"Summary of scores"]
[null,null,"Programme Management","Leadership and capacity",null,"National condom plan/strategy",{"$f":"'Programme Management'!O6","v":"-"}]
[null,null,null,null,null,"Vision or plan for a healthy, sustainable condom market and programme exists ",{"$f":"'Programme Management'!O18","v":"-"}]
[null,null,null,null,null,"Government Leadership and Coordination",{"$f":"'Programme Management'!O20","v":"-"}]
[null,null,null,null,null,"Government Capacity to manage to a total market approach Total Market Approach",{"$f":"'Programme Management'!O25","v":"-"}]
[null,null,null,null,null,"Overall coordination",{"$f":"'Programme Management'!O31","v":"-"}]
[null,null,null,"Policies and regulation",null,"Quality assurance",{"$f":"'Programme Management'!O38","v":"-"}]
[null,null,null,null,null,"Policies",{"$f":"'Programme Management'!O43","v":"-"}]
[null,null,null,null,null,"Regulatory and taxation environment",{"$f":"'Programme Management'!O48","v":"-"}]
[null,null,null,null,null,"Guidance ",{"$f":"'Programme Management'!O53","v":"-"}]
[null,null,null,"Programme analytics",null,"Monitoring and Evaluation Plan",{"$f":"'Programme Management'!O59","v":"-"}]
[null,null,null,null,null,"Data collection, analysis, management, and use",{"$f":"'Programme Management'!O67","v":"-"}]
[null,null,null,"Financing",null,"Budget support",{"$f":"'Programme Management'!O79","v":"-"}]
[null,null,null,null,null,"Market reliance on subsidy",{"$f":"'Programme Management'!O83","v":"-"}]
[null,null,null,null,null,"Market potential and growth",{"$f":"'Programme Management'!O85","v":"-"}]
[null,null,"Programme Implementation","Integration",null,"Condom promotion and distribution activities are integrated into other HIV prevention, family planning and sexual and reproductive health programs",{"$f":"'Programme Implementation'!O6","v":"-"}]
[null,null,null,"Demand",null,"Behavioural data used to inform demand creation activities",{"$f":"'Programme Implementation'!O11","v":"-"}]
[null,null,null,null,null,"Segmentation strategies",{"$f":"'Programme Implementation'!O12","v":"-"}]
[null,null,null,null,null,"Demand creation guidance",{"$f":"'Programme Implementation'!O15","v":"-"}]
{"$rows_left_out":27}
{"sheet":"Next steps","index":9,"n_rows":54,"n_cols":8,"rows_kept":54,"cut":false,"hidden":false,"merged":[[1,2,1,8],[11,2,11,3]]}
[]
[null,null,"Next Steps"]
[]
[null,null,null,null,null,"Element that needs to be addressed","Reason for low performance","Proposed actions (e.g. support required or corrective actions)"]
[null,null,null,null,1,{"$f":"IFERROR(INDEX('Summary of scores'!$F$1:$F$41,SMALL(IF('Summary of scores'!$G$1:$G$41<=$C$12,ROW('Summary of scores'!$G$1:$G$41)),ROW(3:3))),\"\")","v":""}]
[null,null,null,null,2,{"$f":"IFERROR(INDEX('Summary of scores'!$F$1:$F$41,SMALL(IF('Summary of scores'!$G$1:$G$41<=$C$12,ROW('Summary of scores'!$G$1:$G$41)),ROW(4:4))),\"\")","v":""}]
[null,null,null,null,3,{"$f":"IFERROR(INDEX('Summary of scores'!$F$1:$F$41,SMALL(IF('Summary of scores'!$G$1:$G$41<=$C$12,ROW('Summary of scores'!$G$1:$G$41)),ROW(5:5))),\"\")","v":""}]
[null,null,null,null,4,{"$f":"IFERROR(INDEX('Summary of scores'!$F$1:$F$41,SMALL(IF('Summary of scores'!$G$1:$G$41<=$C$12,ROW('Summary of scores'!$G$1:$G$41)),ROW(6:6))),\"\")","v":""}]
[null,null,null,null,5,{"$f":"IFERROR(INDEX('Summary of scores'!$F$1:$F$41,SMALL(IF('Summary of scores'!$G$1:$G$41<=$C$12,ROW('Summary of scores'!$G$1:$G$41)),ROW(7:7))),\"\")","v":""}]
[null,null,null,null,6,{"$f":"IFERROR(INDEX('Summary of scores'!$F$1:$F$41,SMALL(IF('Summary of scores'!$G$1:$G$41<=$C$12,ROW('Summary of scores'!$G$1:$G$41)),ROW(8:8))),\"\")","v":""}]
[null,null,null,null,7,{"$f":"IFERROR(INDEX('Summary of scores'!$F$1:$F$41,SMALL(IF('Summary of scores'!$G$1:$G$41<=$C$12,ROW('Summary of scores'!$G$1:$G$41)),ROW(9:9))),\"\")","v":""}]
[null,null,5,null,8,{"$f":"IFERROR(INDEX('Summary of scores'!$F$1:$F$41,SMALL(IF('Summary of scores'!$G$1:$G$41<=$C$12,ROW('Summary of scores'!$G$1:$G$41)),ROW(10:10))),\"\")","v":""}]
[null,null,null,null,9,{"$f":"IFERROR(INDEX('Summary of scores'!$F$1:$F$41,SMALL(IF('Summary of scores'!$G$1:$G$41<=$C$12,ROW('Summary of scores'!$G$1:$G$41)),ROW(11:11))),\"\")","v":""}]
[null,null,null,null,10,{"$f":"IFERROR(INDEX('Summary of scores'!$F$1:$F$41,SMALL(IF('Summary of scores'!$G$1:$G$41<=$C$12,ROW('Summary of scores'!$G$1:$G$41)),ROW(12:12))),\"\")","v":""}]
[null,null,null,null,11,{"$f":"IFERROR(INDEX('Summary of scores'!$F$1:$F$41,SMALL(IF('Summary of scores'!$G$1:$G$41<=$C$12,ROW('Summary of scores'!$G$1:$G$41)),ROW(13:13))),\"\")","v":""}]
[null,null,null,null,12,{"$f":"IFERROR(INDEX('Summary of scores'!$F$1:$F$41,SMALL(IF('Summary of scores'!$G$1:$G$41<=$C$12,ROW('Summary of scores'!$G$1:$G$41)),ROW(14:14))),\"\")","v":""}]
[null,null,null,null,13,{"$f":"IFERROR(INDEX('Summary of scores'!$F$1:$F$41,SMALL(IF('Summary of scores'!$G$1:$G$41<=$C$12,ROW('Summary of scores'!$G$1:$G$41)),ROW(15:15))),\"\")","v":""}]
[null,null,null,null,14,{"$f":"IFERROR(INDEX('Summary of scores'!$F$1:$F$41,SMALL(IF('Summary of scores'!$G$1:$G$41<=$C$12,ROW('Summary of scores'!$G$1:$G$41)),ROW(16:16))),\"\")","v":""}]
[null,null,null,null,15,{"$f":"IFERROR(INDEX('Summary of scores'!$F$1:$F$41,SMALL(IF('Summary of scores'!$G$1:$G$41<=$C$12,ROW('Summary of scores'!$G$1:$G$41)),ROW(17:17))),\"\")","v":""}]
[null,null,null,null,16,{"$f":"IFERROR(INDEX('Summary of scores'!$F$1:$F$41,SMALL(IF('Summary of scores'!$G$1:$G$41<=$C$12,ROW('Summary of scores'!$G$1:$G$41)),ROW(18:18))),\"\")","v":""}]
{"$rows_left_out":35}
{"sheet":"Bibliography","index":10,"n_rows":41,"n_cols":4,"rows_kept":41,"cut":false,"hidden":false,"merged":[[1,2,1,3]]}
[]
[null,null,"Bibliography"]
[null,null,1," A Total Market Approach. PSI/UNFPA Joint Studies on the Total Market for Male Condoms in Six African Countries: Botswana, Pallin, S.C., D. Meekers, O. Lupu, K. Longfield, 2013"]
[null,null,2,"A Total Market Approach. PSI/UNFPA Joint Studies on the Total Market for Male Condoms in 6 African Countries: Uganda, Pallin, S.C., D. Meekers, O. Lupu, K. Longfield., 2013"]
[null,null,3,"A Total Market Approach. PSI/UNFPA Joint Studies on the Total Market for Male Condoms in Six African Countries: South Africa, Pallin, S.C., D. Meekers, O. Lupu, K. Longfield., 2013"]
[null,null,4,"A Total Market Approach. PSI/UNFPA Joint Studies on the Total Market for Male Condoms in Six African Countries: Swaziland, Pallin, S.C., D. Meekers, O. Lupu, K. Longfield., 2013"]
[null,null,5,"Challenges and Recommendations for reaching Fast-Track targets for condom use, UNAIDS, 2019"]
[null,null,6,"Comprehensive Condom Programming: A guide to resource mobilization and country programming, UNFPA, 2010"]
[null,null,7,"Comprehensive Condom Programming: A guide for resource mobilization and country programming, UNFPA, 2010"]
[null,null,8,"Condom and lubricant programming in high HIV prevalence countries, UNAIDS, 2014"]
[null,null,9,"Condom Market Landscaping Case Study: Botswana, Mann Global Health, 2017"]
[null,null,10,"Condom Market Landscaping Case Study: Kenya, Mann Global Health, 2017"]
[null,null,11,"Condom Market Landscaping Case Study: Tanzania, Mann Global Health, 2017"]
[null,null,12,"Condom Market Landscaping Case Study: Zambia, Mann Global Health, 2017"]
[null,null,13,"Condom Market Landscaping Case Study: Zimbabwe, Mann Global Health, 2017"]
[null,null,14,"Condom Needs and Resource Requirement  Estimation Tool, UNFPA 2019"]
[null,null,15,"Donor Trends Condom Landscape Analysis, Mann Global Health, 2019"]
[null,null,16,"Handbook for Research on the Family Planning Market. Volume 1: Using Data to Inform a Total Market Approach to Family Planning. Chapel Hill, NC: MEASURE Evaluation, University of North Carolina, Meekers, Dominique, Sarah C. Haynes, and Kathryn Kampa, 2016"]
[null,null,17,"Handbook for Research on the Family Planning Market. Volume 2: Tools and Resources for an In-Depth Analysis of the Family Planning Market. Chapel Hill, NC: MEASURE Evaluation, University of North Carolina, Meekers, Dominique, Sarah C. Haynes, and Kathryn Kampa, 2016"]
[null,null,18,"Handbook for Research on the Family Planning Market: Using Data to Inform a Total Market Approach.  Presented at the meeting of the USAID/UNFPA TMA Working Group, D. Meekers, Washington DC, July 26, 2016"]
{"$rows_left_out":22}
{"sheet":"Acronyms","index":11,"n_rows":25,"n_cols":4,"rows_kept":25,"cut":false,"hidden":false,"merged":[[1,2,1,3]]}
[]
[null,null,"Acronyms"]
[null,null,"FP","Family planning"]
[null,null,"FMCG","Fast-moving consumer good "]
[null,null,"FSW","Female sex worker"]
[null,null,"KP","Key populations"]
[null,null,"LoE","Level of effort"]
[null,null,"LMIS","Logistic management information systems "]
[null,null,"M/F","Male/Female"]
[null,null,"MSM","Men who have sex with men "]
[null,null,"MOH","Ministry of health "]
[null,null,"M&E framework","Monitoring and evaluation framework "]
[null,null,"NGO","Non-governmental organisations"]
[null,null,"PP","Priority populations"]
[null,null,"SW","Sex worker"]
[null,null,"SRH","Sexual reproductive health "]
[null,null,"SMers ","Social marketers"]
[null,null,"SM","Social marketing"]
[null,null,"SM","Sustainable condom market/sustainable market "]
[null,null,"TOC","Theory of change"]
{"$rows_left_out":5}