{"text_format":"1","workbook":"xlsx","n_sheets":11,"sheets":["Introducción","Instrucciones","Preguntas frecuentes","Guía para la PrEP","Gestión del programa","Implementación del programa","Resultados del programa ","Resumen de calificaciones","Siguientes pasos","Bibliografía","Acrónimos"],"not_rendered":{"charts":6,"images":1,"macros":1,"external_links":0,"defined_names":25,"comments":0,"pivot_tables":0},"unopened":[],"bounds":{"document_bytes":16777216,"sheet_cells":100000,"rows_first":2000,"rows_last":500,"rows_between":2000,"halvings":0,"cell_chars":16384,"cell_head_chars":4096},"cells_cut":0,"cells_raw":0,"read":"whole","date_system":"1900"}

{"sheet":"Introducción","index":0,"n_rows":2,"n_cols":3,"rows_kept":2,"cut":false,"hidden":false,"merged":[[1,2,1,22]]}
[]
[null,null,"¿Cuáles son las herramientas de autoevaluación para la prevención del VIH (PSAT)?"]

{"sheet":"Instrucciones","index":1,"n_rows":57,"n_cols":19,"rows_kept":57,"cut":false,"hidden":false,"merged":[[2,2,2,17]]}
[]
[]
[null,null,"Cómo completar la herramientas de autoevaluación para la prevención del VIH (PSAT)"]
[]
[]
[]
[]
[]
[]
[]
[]
[]
[]
[]
[]
[]
[]
[]
[]
[]
{"$rows_left_out":38}
{"sheet":"Preguntas frecuentes","index":2,"n_rows":2,"n_cols":3,"rows_kept":2,"cut":false,"hidden":false,"merged":[[1,2,1,22]]}
[]
[null,null,"Preguntas frecuentes"]

{"sheet":"Guía para la PrEP","index":3,"n_rows":2,"n_cols":3,"rows_kept":2,"cut":false,"hidden":false,"merged":[[1,2,1,22]]}
[]
[null,null,"Oferta de profilaxis preexposición (PrEP)"]

{"sheet":"Gestión del programa","index":4,"n_rows":48,"n_cols":16,"rows_kept":48,"cut":false,"hidden":false,"merged":[[11,2,19,2],[23,2,23,10],[33,2,33,10],[11,9,19,9],[20,9,22,9],[24,9,26,9],[27,9,32,9],[1,2,1,9],[3,3,3,4],[4,2,4,10],[5,2,10,2],[6,9,10,9],[34,9,42,9],[20,2,22,2],[24,2,26,2],[27,2,32,2],[34,2,42,2]]}
[]
[null,null,"Gestión del programa"]
[]
[null,null,"Elemento","Criterios",null,"N/A","Ausente","Presente pero no óptimo","Presente y funcionando bien","Promedio del elemento","Comentarios (si procede)","Absent","Present","Optimal","Average","Sustainability Single Figure"]
[null,null,"Estrategia, política y regulación"]
[null,null,"Estrategia nacional de prevención del VIH","○","La PrEP como parte de la prevención integral del VIH en la estrategia nacional para el VIH",null,null,null,null,null,null,{"$f":"IF(ISBLANK(G6),0,1)","v":0},{"$f":"IF(ISBLANK(H6),0,3)","v":0},{"$f":"IF(ISBLANK(I6),0,5)","v":0},{"$f":"IFERROR(ROUND(AVERAGEIF(L6:N11,\"<>0\",L6:N11),0),\"-\")","v":"-"}]
[null,null,null,"○","La PrEP oral y la PrEP de acción prolongada (anillo de dapivirina e inyectables) se incluyen como parte de la prevención integral del VIH en la estrategia nacional para el VIH",null,null,null,null,{"$f":"IFERROR(O6,\"-\")","v":"-"},null,0,0,0]
[null,null,null,"○","Hay información detallada para servir como guía en la implementación de los programas de PrEP",null,null,null,null,null,null,0,0,0]
[null,null,null,"○","El enfoque de la implementación de la PrEP está basado en las directrices de la OMS o en la experiencia a nivel nacional",null,null,null,null,null,null,0,0,0]
[null,null,null,"○","El programa de PrEP está integrado en el protocolo rutinario del sistema de salud.",null,null,null,null,null,null,0,0,0,null,{"$f":"IF(MAX(L10:N10)=0,\"\",MAX(L10:N10))","v":""}]
[null,null,null,"○","La PrEP está disponible para todas las personas en riesgo sustancial   ",null,null,null,null,null,null,0,0,0]
[null,null,"Directrices clínicas a nivel nacional","○","Existen directrices clínicas sobre la PrEP a nivel nacional, o las directrices sobre la PrEP se incluyen en las directrices nacionales de la TAR ",null,null,null,null,{"$f":"IFERROR(O12,\"-\")","v":"-"},null,0,0,0,{"$f":"IFERROR(ROUND(AVERAGEIF(L12:N20,\"<>0\",L12:N20),0),\"-\")","v":"-"}]
[null,null,null,"○","Hay información detallada para guiar a los proveedores de PrEP en alguna de las siguientes áreas: análisis de elegibilidad e iniciación, pruebas de laboratorio, cronograma de seguimiento o asesoramiento.",null,null,null,null,null,null,0,0,0]
[null,null,null,"○","Las directrices han sido aprobadas o aceptadas por las asociaciones de proveedores.",null,null,null,null,null,null,0,0,0]
[null,null,null,"○","Las directrices incluyen orientación sobre quién puede proporcionar la PrEP y la formación necesaria para ello.",null,null,null,null,null,null,0,0,0]
[null,null,null,"○","Las directrices están basadas en las de la OMS y en la experiencia a nivel nacional. ",null,null,null,null,null,null,0,0,0]
[null,null,null,"○","Las directrices son de aplicación y están disponibles para todos los proveedores de PrEP (tanto del sector público como del privado)",null,null,null,null,null,null,0,0,0]
[null,null,null,"○","Las directrices incluyen el fomento del seguimiento clínico para las personas que compran PrEP online.",null,null,null,null,null,null,0,0,0]
[null,null,null,"○","Las directrices incluyen la PrEP oral diaria, la PrEP dispensada en eventos concretos y los métodos de PrEP de acción prolongada (anillo de dapivirina, inyectables).",null,null,null,null,null,null,0,0,0]
[null,null,null,"○","Se han incorporado las medidas de prevención y control de la  COVID-19 a todas las estrategias, planes y directrices de prevención del VIH y de PrEP.",null,null,null,null,null,null,0,0,0]
{"$rows_left_out":29}
{"sheet":"Implementación del programa","index":5,"n_rows":157,"n_cols":16,"rows_kept":157,"cut":false,"hidden":false,"merged":[[145,9,152,9],[71,9,76,9],[77,9,79,9],[80,9,90,9],[91,9,99,9],[100,9,109,9],[110,9,115,9],[116,9,117,9],[71,2,76,2],[77,2,79,2],[119,9,127,9],[128,9,138,9],[139,9,144,9],[139,2,144,2],[57,9,62,9],[63,9,66,9],[67,9,69,9],[44,2,51,2],[53,2,56,2],[57,2,62,2],[63,2,66,2],[67,2,69,2],[39,2,43,2],[5,9,11,9],[39,9,43,9],[44,9,51,9],[53,9,56,9],[17,9,25,9],[26,9,33,9],[12,9,16,9],[35,9,38,9],[35,2,38,2],[1,2,1,7],[5,2,11,2],[12,2,16,2],[17,2,25,2],[26,2,33,2],[145,2,152,2],[80,2,90,2],[91,2,99,2],[100,2,109,2],[110,2,115,2],[116,2,117,2],[119,2,127,2],[128,2,138,2]]}
[]
[]
[]
[null,null,"Elemento","Criterios",null,"N/A","Ausente","Presente pero no óptimo","Presente y funcionando bien","Promedio del elemento","Comentarios (si procede)","Absent","Present","Optimal","Average","Sustainability Single Figure"]
[null,null,"Definición de objetivos y planificación"]
[null,null,"Planes de trabajo para la implementación",null,"Políticas y planes de trabajo",null,null,null,null,{"$f":"IFERROR(O6,\"-\")","v":"-"},null,null,null,null,{"$f":"IFERROR(ROUND(AVERAGEIF(L7:N12,\"<>0\",L7:N12),0),\"-\")","v":"-"}]
[null,null,null,"○","Existen planes de trabajo a nivel nacional y regional.",null,null,null,null,null,null,{"$f":"IF(ISBLANK(G7),0,1)","v":0},{"$f":"IF(ISBLANK(H7),0,3)","v":0},{"$f":"IF(ISBLANK(I7),0,5)","v":0}]
[null,null,null,"○","Las poblaciones objetivo participan en el desarrollo de los planes de trabajo.",null,null,null,null,null,null,0,0,0]
[null,null,null,"○","Existe una clara delegación de responsabilidades y se han definido las líneas de reporte.",null,null,null,null,null,null,0,0,0]
[null,null,null,"○","Existen cronogramas y mecanismos de presentación de informes.",null,null,null,null,null,null,0,0,0]
[null,null,null,"○","Existen mecanismos de revisión y seguimiento.",null,null,null,null,null,null,0,0,0]
[null,null,null,"○","Las acciones y los elementos de programa tienen un vínculo claro con las líneas presupuestarias.",null,null,null,null,null,null,0,0,0]
[null,null,"Evaluación de la población en riesgo","○","Las poblaciones prioritarias están determinadas por el perfil epidémico del VIH, la incidencia del VIH, la prevalencia y la distribución geográfica del riesgo.",null,null,null,null,{"$f":"IFERROR(O13,\"-\")","v":"-"},null,0,0,0,{"$f":"IFERROR(ROUND(AVERAGEIF(L13:N17,\"<>0\",L13:N17),0),\"-\")","v":"-"}]
[null,null,null,"○","Los miembros de los grupos prioritarios y de población clave participan en la evaluación de las poblaciones en riesgo.",null,null,null,null,null,null,0,0,0]
[null,null,null,"○","La evaluación sobre dónde y cómo ampliar la implementación se realiza mediante herramientas que están disponibles para todo el mundo (ej.: herramientas OPTIONS Plan4PrEP, PrEP-It, herramientas de la OMS para la implementación de la PrEP).        ",null,null,null,null,null,null,0,0,0]
[null,null,null,"○","El enfoque no es estigmatizante: los documentos públicos siempre se refieren a comportamientos de alto riesgo y no nombran a los grupos de población clave.",null,null,null,null,null,null,0,0,0]
[null,null,null,"○","A nivel regional, los datos se desglosan por género, grupo de población clave y edad, con franjas de edad más pequeñas para las poblaciones más jóvenes (15-19, 20-24, 25-29, etc.).",null,null,null,null,null,null,0,0,0]
[null,null," Objetivos de los indicadores","○","Se han establecido unos objetivos para los indicadores de resultados de los programas a nivel nacional y regional.",null,null,null,null,{"$f":"IFERROR(O18,\"-\")","v":"-"},null,0,0,0,{"$f":"IFERROR(ROUND(AVERAGEIF(L18:N26,\"<>0\",L18:N26),0),\"-\")","v":"-"}]
[null,null,null,"○","Los objetivos se basan en la incidencia y prevalencia del VIH a nivel nacional y regional, y en la evaluación de la población en riesgo.",null,null,null,null,null,null,0,0,0]
[null,null,null,"○","Los objetivos se basan en los datos de implementación del país (por ejemplo, en estudios demostrativos, si procede).",null,null,null,null,null,null,0,0,0]
{"$rows_left_out":138}
{"sheet":"Resultados del programa ","index":6,"n_rows":37,"n_cols":15,"rows_kept":37,"cut":false,"hidden":false,"merged":[[16,9,20,9],[21,9,26,9],[11,9,15,9],[27,9,32,9],[1,2,1,8],[5,2,10,2],[5,9,10,9],[11,2,15,2],[16,2,20,2],[21,2,26,2],[27,2,32,2]]}
[]
[null,null,"Resultados del programa"]
[]
[null,null,"Elemento","Criterios",null,"N/A","Ausente","Presente pero no óptimo","Presente y funcionando bien","Promedio del elemento","Comentarios (si procede)","Absent","Present","Optimal","Average"]
[null,null,"Resultados e indicadores"]
[null,null,"Uso de PrEP","○","Se dispone de indicadores de uso de PrEP para todas las modalidades (PrEP oral, anillo, inyectables de acción prolongada).",null,null,null,null,{"$f":"IFERROR(O6,\"-\")","v":"-"},null,{"$f":"IF(ISBLANK(G6),0,1)","v":0},{"$f":"IF(ISBLANK(H6),0,3)","v":0},{"$f":"IF(ISBLANK(I6),0,5)","v":0},{"$f":"IFERROR(ROUND(AVERAGEIF(L6:N11,\"<>0\",L6:N11),0),\"-\")","v":"-"}]
[null,null,null,"○","Los indicadores se definen como: % de personas aptas que iniciaron la [modalidad PrEP seleccionada] durante el periodo recogido en el informe                            ",null,null,null,null,null,null,0,0,0]
[null,null,null,"○","Los datos indicadores del uso de PrEP se recopilan trimestralmente.",null,null,null,null,null,null,0,0,0]
[null,null,null,"○","Los indicadores para la [modalidad PrEP seleccionada] se desglosan por género, población clave, unidad geográfica y edad, con franjas de edad más pequeñas para poblaciones más jóvenes (15-19, 20-24, 25-29, etc.).                                    ",null,null,null,null,null,null,0,0,0]
[null,null,null,"○","Los indicadores de la [modalidad PrEP seleccionada] se desglosan por uso de PrEP por primera vez y uso repetitivo.",null,null,null,null,null,null,0,0,0]
[null,null,null,"○","Se cumple el objetivo definido a nivel nacional (ya sea trimestral o anual).",null,null,null,null,null,null,0,0,0]
[null,null,"Continuación de la PrEP","○","Existen indicadores de continuación de la PrEP para todas las modalidades disponibles (PrEP oral, anillo, inyectables de acción prolongada).",null,null,null,null,{"$f":"IFERROR(O12,\"-\")","v":"-"},null,0,0,0,{"$f":"IFERROR(ROUND(AVERAGEIF(L12:N16,\"<>0\",L12:N16),0),\"-\")","v":"-"}]
[null,null,null,"○","Los indicadores se definen como: % de usuarios de la [modalidad PrEP seleccionada] que continuaron con la [modalidad de PrEP seleccionada] durante 3 meses consecutivos tras haber iniciado la profilaxis durante el periodo recogido en el informe.              ",null,null,null,null,null,null,0,0,0]
[null,null,null,"○","Los datos indicadores de la continuación de la PrEP se recopilan trimestralmente.",null,null,null,null,null,null,0,0,0]
[null,null,null,"○","Los indicadores para la [modalidad PrEP seleccionada] se desglosan por género, población clave, unidad geográfica y edad, con franjas de edad más pequeñas para poblaciones más jóvenes (15-19, 20-24, 25-29, etc.).                                       ",null,null,null,null,null,null,0,0,0]
[null,null,null,"○","Se cumple el objetivo definido a nivel nacional (ya sea trimestral o anual).",null,null,null,null,null,null,0,0,0]
[null,null,"Uso actual de PrEP","○","Se han establecido indicadores de uso actual de PrEP para todas las modalidades disponibles (PrEP oral, anillo, inyectables de acción prolongada).",null,null,null,null,{"$f":"IFERROR(O17,\"-\")","v":"-"},null,0,0,0,{"$f":"IFERROR(ROUND(AVERAGEIF(L17:N21,\"<>0\",L17:N21),0),\"-\")","v":"-"}]
[null,null,null,"○","Los indicadores se definen como: número de personas que recibieron [seleccionar modalidad PrEP] al menos una vez durante el periodo recogido en el informe.",null,null,null,null,null,null,0,0,0]
[null,null,null,"○","Los datos indicadores del uso actual de PrEP se recopilan trimestralmente.",null,null,null,null,null,null,0,0,0]
[null,null,null,"○","Los indicadores para [modalidad PrEP seleccionada] se desglosan por género, población clave, unidad geográfica y edad, con franjas de edad más pequeñas para poblaciones más jóvenes (15-19, 20-24, 25-29, etc.).                                    ",null,null,null,null,null,null,0,0,0]
{"$rows_left_out":18}
{"sheet":"Resumen de calificaciones","index":7,"n_rows":41,"n_cols":11,"rows_kept":41,"cut":false,"hidden":false,"merged":[[29,2,35,2],[29,3,33,3],[1,2,1,6],[2,2,7,2],[2,3,4,3],[5,3,6,3],[8,2,28,2],[8,3,11,3],[12,3,14,3],[15,3,18,3],[19,3,20,3],[21,3,24,3],[25,3,28,3]]}
[]
[null,null,"Resumen de calificaciones"]
[null,null,"Gestión del programa","Estrategia, política y regulación",null,"Presupuesto de la estrategia nacional de prevención del VIH",{"$f":"'Gestión del programa'!O6","v":"-"}]
[null,null,null,null,null,"Directrices clínicas a nivel nacional",{"$f":"'Gestión del programa'!O12","v":"-"}]
[null,null,null,null,null,"Situación reglamentaria de los medicamentos de PrEP",{"$f":"'Gestión del programa'!O21","v":"-"}]
[null,null,null,"Liderazgo y coordinación",null,"Liderazgo y rendición de cuentas",{"$f":"'Gestión del programa'!O25","v":"-"}]
[null,null,null,null,null,"Participación de las partes interesadas",{"$f":"'Gestión del programa'!O28","v":"-"}]
[null,null,null,"Financiación",null,"Presupuesto",{"$f":"'Gestión del programa'!O35","v":"-"}]
[null,null,"Implementación del programa","Orientación y planificación",null,"Planes de trabajo para la implementación",{"$f":"'Implementación del programa'!O6","v":"-"}]
[null,null,null,null,null,"Evaluación de la población en riesgo",{"$f":"'Implementación del programa'!O13","v":"-"}]
[null,null,null,null,null,"Objetivos de los indicadores",{"$f":"'Implementación del programa'!O18","v":"-"}]
[null,null,null,null,null,"Estrategia de comunicación",{"$f":"'Implementación del programa'!O27","v":"-"}]
[null,null,null,"Suministro",null,"Cuantificación de la necesidad de productos básicos",{"$f":"'Implementación del programa'!O36","v":"-"}]
[null,null,null,null,null,"Plan de aprovisionamiento de productos básicos",{"$f":"'Implementación del programa'!O40","v":"-"}]
[null,null,null,null,null,"Cadena de suministro/GLSI",{"$f":"'Implementación del programa'!O45","v":"-"}]
[null,null,null,"Prestación de servicios",null,"Diferenciados",{"$f":"'Implementación del programa'!O54","v":"-"}]
[null,null,null,null,null,"Integrados",{"$f":"'Implementación del programa'!O58","v":"-"}]
[null,null,null,null,null,"Accesibles",{"$f":"'Implementación del programa'!O64","v":"-"}]
[null,null,null,null,null,"Aceptables",{"$f":"'Implementación del programa'!O68","v":"-"}]
[null,null,null,"Soporte a la prestación de servicios",null,"Formación",{"$f":"'Implementación del programa'!O72","v":"-"}]
{"$rows_left_out":22}
{"sheet":"Siguientes pasos","index":8,"n_rows":54,"n_cols":8,"rows_kept":54,"cut":false,"hidden":false,"merged":[[1,2,1,8],[11,2,11,3]]}
[]
[null,null,"Siguientes pasos"]
[]
[null,null,null,null,null,"Elemento que debe abordarse","Motivo del bajo rendimiento","Acciones propuestas (e.j.: apoyo necesario o acciones correctivas)"]
[null,null,null,null,1,{"$f":"IFERROR(INDEX('Resumen de calificaciones'!$F$1:$F$93,SMALL(IF('Resumen de calificaciones'!$G$1:$G$93<=$C$12,ROW('Resumen de calificaciones'!$G$1:$G$93)),ROW(3:3))),\"\")","v":0}]
[null,null,null,null,2,{"$f":"IFERROR(INDEX('Resumen de calificaciones'!$F$1:$F$93,SMALL(IF('Resumen de calificaciones'!$G$1:$G$93<=$C$12,ROW('Resumen de calificaciones'!$G$1:$G$93)),ROW(4:4))),\"\")","v":0}]
[null,null,null,null,3,{"$f":"IFERROR(INDEX('Resumen de calificaciones'!$F$1:$F$93,SMALL(IF('Resumen de calificaciones'!$G$1:$G$93<=$C$12,ROW('Resumen de calificaciones'!$G$1:$G$93)),ROW(5:5))),\"\")","v":0}]
[null,null,null,null,4,{"$f":"IFERROR(INDEX('Resumen de calificaciones'!$F$1:$F$93,SMALL(IF('Resumen de calificaciones'!$G$1:$G$93<=$C$12,ROW('Resumen de calificaciones'!$G$1:$G$93)),ROW(6:6))),\"\")","v":0}]
[null,null,null,null,5,{"$f":"IFERROR(INDEX('Resumen de calificaciones'!$F$1:$F$93,SMALL(IF('Resumen de calificaciones'!$G$1:$G$93<=$C$12,ROW('Resumen de calificaciones'!$G$1:$G$93)),ROW(7:7))),\"\")","v":0}]
[null,null,null,null,6,{"$f":"IFERROR(INDEX('Resumen de calificaciones'!$F$1:$F$93,SMALL(IF('Resumen de calificaciones'!$G$1:$G$93<=$C$12,ROW('Resumen de calificaciones'!$G$1:$G$93)),ROW(8:8))),\"\")","v":0}]
[null,null,null,null,7,{"$f":"IFERROR(INDEX('Resumen de calificaciones'!$F$1:$F$93,SMALL(IF('Resumen de calificaciones'!$G$1:$G$93<=$C$12,ROW('Resumen de calificaciones'!$G$1:$G$93)),ROW(9:9))),\"\")","v":0}]
[null,null,null,null,8,{"$f":"IFERROR(INDEX('Resumen de calificaciones'!$F$1:$F$93,SMALL(IF('Resumen de calificaciones'!$G$1:$G$93<=$C$12,ROW('Resumen de calificaciones'!$G$1:$G$93)),ROW(10:10))),\"\")","v":0}]
[null,null,null,null,9,{"$f":"IFERROR(INDEX('Resumen de calificaciones'!$F$1:$F$93,SMALL(IF('Resumen de calificaciones'!$G$1:$G$93<=$C$12,ROW('Resumen de calificaciones'!$G$1:$G$93)),ROW(11:11))),\"\")","v":0}]
[null,null,null,null,10,{"$f":"IFERROR(INDEX('Resumen de calificaciones'!$F$1:$F$93,SMALL(IF('Resumen de calificaciones'!$G$1:$G$93<=$C$12,ROW('Resumen de calificaciones'!$G$1:$G$93)),ROW(12:12))),\"\")","v":0}]
[null,null,null,null,11,{"$f":"IFERROR(INDEX('Resumen de calificaciones'!$F$1:$F$93,SMALL(IF('Resumen de calificaciones'!$G$1:$G$93<=$C$12,ROW('Resumen de calificaciones'!$G$1:$G$93)),ROW(13:13))),\"\")","v":0}]
[null,null,null,null,12,{"$f":"IFERROR(INDEX('Resumen de calificaciones'!$F$1:$F$93,SMALL(IF('Resumen de calificaciones'!$G$1:$G$93<=$C$12,ROW('Resumen de calificaciones'!$G$1:$G$93)),ROW(14:14))),\"\")","v":0}]
[null,null,null,null,13,{"$f":"IFERROR(INDEX('Resumen de calificaciones'!$F$1:$F$93,SMALL(IF('Resumen de calificaciones'!$G$1:$G$93<=$C$12,ROW('Resumen de calificaciones'!$G$1:$G$93)),ROW(15:15))),\"\")","v":0}]
[null,null,null,null,14,{"$f":"IFERROR(INDEX('Resumen de calificaciones'!$F$1:$F$93,SMALL(IF('Resumen de calificaciones'!$G$1:$G$93<=$C$12,ROW('Resumen de calificaciones'!$G$1:$G$93)),ROW(16:16))),\"\")","v":0}]
[null,null,null,null,15,{"$f":"IFERROR(INDEX('Resumen de calificaciones'!$F$1:$F$93,SMALL(IF('Resumen de calificaciones'!$G$1:$G$93<=$C$12,ROW('Resumen de calificaciones'!$G$1:$G$93)),ROW(17:17))),\"\")","v":0}]
[null,null,null,null,16,{"$f":"IFERROR(INDEX('Resumen de calificaciones'!$F$1:$F$93,SMALL(IF('Resumen de calificaciones'!$G$1:$G$93<=$C$12,ROW('Resumen de calificaciones'!$G$1:$G$93)),ROW(18:18))),\"\")","v":0}]
{"$rows_left_out":35}
{"sheet":"Bibliografía","index":9,"n_rows":29,"n_cols":4,"rows_kept":29,"cut":false,"hidden":false,"merged":[[1,2,1,3]]}
[]
[null,null,"Bibliografía"]
[null,null,1,"CDC (2017). Directrices de PrEP: suplemento para proveedores de CDC"]
[null,null,2,"OMS (2016). Directrices consolidadas sobre el uso de medicamentos antirretrovirales para tratar y prevenir la infección por el VIH"]
[null,null,3,"WHO (2017). Herramienta de implementación para la profilaxis previa a la exposición de la infección por VIH"]
[null,null,4,"OPCIONES (2019). Paquete de formación para proveedores: administración efectiva de PrEP oral para chicas adolescentes y mujeres jóvenes"]
[null,null,5,"OPCIONES (2019). Herramienta PrEP-it"]
[null,null,6,"OMS (2016). Recomendaciones para un enfoque de salud pública - Segunda edición"]
[null,null,7,"ONUSIDA (2017). Hoja de ruta para la prevención del VIH 2020"]
[null,null,8,"ONUSIDA (2005). Directrices para la gestión de la cadena de suministro del VIH"]
[null,null,9,"OMS (2015). Buenas prácticas para la distribución de productos farmacéuticos de la OMS"]
[null,null,10,"OMS (2017). Herramienta de la OMS para la implementación de la profilaxis preexposición a la infección por VIH"]
[null,null,11,"OMS (2019) ¿Qué es el 2+1+1? Profilaxis oral preexposición por eventos concretos para prevenir el VIH en hombres que tienen relaciones sexuales con hombres: actualización de la recomendación de la OMS sobre la PrEP oral"]
[null,null,12,"OMS (2021) Recomendaciones actualizadas sobre la prevención del VIH, el diagnóstico infantil, el inicio y el seguimiento de los tratamientos antirretrovirales"]
[null,null,13,"OMS (2020) Vigilancia de la resistencia a los medicamentos contra el VIH en países que amplían la profilaxis preexposición"]
[null,null,14,"OMS (2020) Directrices consolidadas de información estratégica sobre el VIH: impulsar el impacto a través del seguimiento y la gestión de los programas"]
[null,null,15,"PEPFAR (2020) Monitoring, Evaluation, and Reporting Indicator Reference Guide - MER 2.0 (versión 2.5)"]
[null,null,16,"OMS (2019) Prevención y control de las infecciones de transmisión sexual (ITS) en la era de la profilaxis oral preexposición (PrEP) al VIH"]
[null,null,17,"ONUSIDA pone fin a las desigualdades. Poner fin al sida. Estrategia mundial sobre el sida 2021-2026"]
[null,null,18,"OMS (2018) Herramienta de implementación para la profilaxis preexposición (PrEP) a la infección por VIH. Módulo 12: adolescentes y adultos jóvenes"]
{"$rows_left_out":10}
{"sheet":"Acrónimos","index":10,"n_rows":39,"n_cols":4,"rows_kept":39,"cut":false,"hidden":false,"merged":[[1,2,1,8]]}
[]
[null,null,"Acrónimos"]
[]
[null,null,"AGYW","Chicas adolescentes y mujeres jóvenes "]
[null,null,"AID","Anillo intravaginal de dapivirina"]
[null,null,"APH","Asesoramiento y pruebas del VIH"]
[null,null,"APost","Atención postnatal"]
[null,null,"APre","Atención prenatal"]
[null,null,"CMMV","Circuncisión Médica Masculina Voluntaria"]
[null,null,"CrCl","Prueba de aclaramiento de creatinina"]
[null,null,"CV","Carga viral"]
[null,null,"GTT","Grupo técnico de trabajo "]
[null,null,"HSH","Hombres que tienen sexo con hombres "]
[null,null,"ITS ","Infección de transmisión sexual"]
[null,null,"LME","Lista de medicamentos esenciales"]
[null,null,"MAR","Medicamentos antirretrovirales"]
[null,null,"OMS","Organización Mundial de la Salud "]
[null,null,"ONUSIDA","Programa Conjunto de las Naciones Unidas sobre el VIH/Sida "]
[null,null,"PAT","Plan de asistencia técnica"]
[null,null,"PC","Poblaciones clave "]
{"$rows_left_out":19}