{"text_format":"1","workbook":"xlsx","n_sheets":12,"sheets":["Summary of scores (2)","Introduction","Instructions","Foire aux questions","Lignes directrices pour la PaE","Gestion de programme","Mise en œuvre de programme","Résultats de programme ","Résumé des notes","Étapes suivantes","Bibliographie","Acronymes"],"not_rendered":{"charts":6,"images":1,"macros":1,"external_links":0,"defined_names":28,"comments":1,"pivot_tables":0},"unopened":[],"bounds":{"document_bytes":16777216,"sheet_cells":100000,"rows_first":2000,"rows_last":500,"rows_between":2000,"halvings":0,"cell_chars":16384,"cell_head_chars":4096},"cells_cut":0,"cells_raw":0,"read":"whole","date_system":"1900"}

{"sheet":"Summary of scores (2)","index":0,"n_rows":142,"n_cols":6,"rows_kept":142,"cut":false,"hidden":true,"merged":[[109,2,141,2],[109,3,136,3],[137,3,141,3],[1,2,1,6],[68,2,74,2],[68,3,71,3],[72,3,73,3],[76,2,108,2],[93,3,97,3],[99,3,100,3],[101,3,108,3],[76,3,79,3],[80,3,82,3],[83,3,86,3],[87,3,89,3],[90,3,92,3],[74,3,75,3],[2,2,67,2],[2,3,23,3],[24,3,45,3],[46,3,67,3]]}
[]
[null,null,"Summary of scores"]
[null,null,"Prevention\nPackages","AGYW Prevention Package\n(HIGH Incidence Locations)",null,"Risk Assessment / Profiling"]
[null,null,null,null,null,"Male and female condoms and lubricants "]
[null,null,null,null,null,"HIV testing, treatment, counselling and support"]
[null,null,null,null,null,"Pre-exposure Prophylaxis"]
[null,null,null,null,null,"STI diagnosis & service integration"]
[null,null,null,null,null,"SRH services incl. contraceptive mix"]
[null,null,null,null,null,"GBV services, post-rape care "]
[null,null,null,null,null,"Antenatal care (ANC) including PMTCT"]
[null,null,null,null,null,"Clinical service package for sex partners of AGYW"]
[null,null,null,null,null,"Accessible services"]
[null,null,null,null,null,"Youth-friendly/Acceptable services"]
[null,null,null,null,null,"Sensitisation"]
[null,null,null,null,null,"School-based prevention campaigns"]
[null,null,null,null,null,"Comprehensive sexuality education"]
[null,null,null,null,null,"Keeping girls in school"]
[null,null,null,null,null,"Community Mobilisation & demand generation"]
[null,null,null,null,null,"Increasing access to justice (policy and legal) "]
[null,null,null,null,null,"Gender-based violence prevention and management "]
{"$rows_left_out":123}
{"sheet":"Introduction","index":1,"n_rows":2,"n_cols":3,"rows_kept":2,"cut":false,"hidden":false,"merged":[[1,2,1,22]]}
[]
[null,null,"Que sont les Outils d’auto-évaluation pour la prévention du VIH (OAEP) ?"]

{"sheet":"Instructions","index":2,"n_rows":57,"n_cols":19,"rows_kept":57,"cut":false,"hidden":false,"merged":[[2,2,2,17]]}
[]
[]
[null,null,"Comment compléter l’outil d’auto-évaluation pour la prévention (OAEP) ?"]
[]
[]
[]
[]
[]
[]
[]
[]
[]
[]
[]
[]
[]
[]
[]
[]
[]
{"$rows_left_out":38}
{"sheet":"Foire aux questions","index":3,"n_rows":2,"n_cols":3,"rows_kept":2,"cut":false,"hidden":false,"merged":[[1,2,1,22]]}
[]
[null,null,"Foire aux questions"]

{"sheet":"Lignes directrices pour la PaE","index":4,"n_rows":2,"n_cols":3,"rows_kept":2,"cut":false,"hidden":false,"merged":[[1,2,1,22]]}
[]
[null,null,"Offre de prophylaxie avant exposition"]

{"sheet":"Gestion de programme","index":5,"n_rows":48,"n_cols":16,"rows_kept":48,"cut":false,"hidden":false,"merged":[[20,2,22,2],[34,2,42,2],[20,9,22,9],[24,9,26,9],[27,9,32,9],[34,9,42,9],[24,2,26,2],[27,2,32,2],[1,2,1,9],[3,3,3,4],[6,9,10,9],[11,9,19,9],[5,2,10,2],[11,2,19,2]]}
[]
[null,null,"Gestion de programme"]
[]
[null,null,"Élément","Critères",null,"S/O","Absent","Présent mais non optimal","Présent et fonctionnel","Moyenne de l’élément","Commentaires\n(le cas échéant)","Absent","Present","Optimal","Average","Sustainability Single Figure"]
[null,null,"Stratégie, politique et réglementation"]
[null,null,"Stratégie nationale de prévention          du VIH","○","La PaE en composante de la prévention globale du VIH dans la stratégie nationale de lutte contre le VIH",null,null,null,null,null,null,{"$f":"IF(ISBLANK(G6),0,1)","v":0},{"$f":"IF(ISBLANK(H6),0,3)","v":0},{"$f":"IF(ISBLANK(I6),0,5)","v":0},{"$f":"IFERROR(ROUND(AVERAGEIF(L6:N11,\"<>0\",L6:N11),0),\"-\")","v":"-"}]
[null,null,null,"○","La PaE orale et la PaE à action prolongée (à savoir l’AVD et les préparations injectables) constituent une composante de la prévention globale du VIH dans la stratégie nationale de lutte contre le VIH",null,null,null,null,{"$f":"IFERROR(O6,\"-\")","v":"-"},null,{"$f":"IF(ISBLANK(G7),0,1)","v":0},{"$f":"IF(ISBLANK(H7),0,3)","v":0},{"$f":"IF(ISBLANK(I7),0,5)","v":0}]
[null,null,null,"○","Suffisamment détaillée pour guider la mise en œuvre des programmes de PaE",null,null,null,null,null,null,0,0,0]
[null,null,null,"○","Vision du déploiement de la PaE basée sur les lignes directrices de l’OMS ou sur l’expérience du pays",null,null,null,null,null,null,0,0,0]
[null,null,null,"○","Programme de PaE intégré au système de santé ordinaire",null,null,null,null,null,null,0,0,0,null,{"$f":"IF(MAX(L10:N10)=0,\"\",MAX(L10:N10))","v":""}]
[null,null,null,"○","La PaE est à la disposition de toutes les personnes présentant un risque important",null,null,null,null,null,null,0,0,0]
[null,null,"Directives cliniques nationales","○","Des directives cliniques nationales sur la PaE sont en place OU des lignes directrices sur la PaE figurent dans les directives nationales sur la PaE ",null,null,null,null,{"$f":"IFERROR(O12,\"-\")","v":"-"},null,0,0,0,{"$f":"IFERROR(ROUND(AVERAGEIF(L12:N20,\"<>0\",L12:N20),0),\"-\")","v":"-"}]
[null,null,null,"○","Elles sont suffisamment détaillées pour orienter les prestataires de la PaE dans un ou plusieurs des domaines suivants : sélection et initiation de l’éligibilité, tests de laboratoire, calendrier de suivi, conseil",null,null,null,null,null,null,0,0,0]
[null,null,null,"○","Les directives ont été approuvées ou acceptées par les associations de prestataires",null,null,null,null,null,null,0,0,0]
[null,null,null,"○","Les directives comprennent des lignes directrices sur les personnes qui peuvent dispenser la PaE et sur la formation requise",null,null,null,null,null,null,0,0,0]
[null,null,null,"○","Directives informées par les lignes directrices de l’OMS et l’expérience du pays ",null,null,null,null,null,null,0,0,0]
[null,null,null,"○","Applicables et disponibles pour tous les prestataires de PaE (publics et privés)",null,null,null,null,null,null,0,0,0]
[null,null,null,"○","Les directives incluent la promotion du suivi clinique des personnes qui achètent la PaE en ligne",null,null,null,null,null,null,0,0,0]
[null,null,null,"○","Les directives couvrent la PaE orale quotidienne, la PaE événementielle et les méthodes de PaE à action prolongée (AVD, préparations injectables)",null,null,null,null,null,null,0,0,0]
[null,null,null,"○","Des mesures de prévention et de contrôle de l’infection COVID-19 sont intégrées à l’ensemble des stratégies, plans et directives de prévention du VIH et de PaE",null,null,null,null,null,null,0,0,0]
{"$rows_left_out":29}
{"sheet":"Mise en œuvre de programme","index":6,"n_rows":157,"n_cols":16,"rows_kept":157,"cut":false,"hidden":false,"merged":[[26,2,33,2],[35,2,38,2],[39,2,43,2],[44,2,51,2],[53,2,56,2],[100,2,109,2],[110,2,115,2],[116,2,117,2],[119,2,127,2],[1,2,1,7],[67,2,69,2],[71,2,76,2],[77,2,79,2],[80,2,90,2],[4,2,4,9],[34,2,34,9],[52,2,52,9],[70,2,70,9],[5,2,11,2],[12,2,16,2],[77,9,79,9],[57,9,62,9],[63,9,66,9],[67,9,69,9],[71,9,76,9],[91,2,99,2],[57,2,62,2],[63,2,66,2],[6,9,11,9],[12,9,16,9],[17,9,25,9],[26,9,33,9],[35,9,38,9],[119,9,127,9],[128,9,138,9],[139,9,144,9],[145,9,152,9],[17,2,25,2],[80,9,90,9],[91,9,99,9],[100,9,109,9],[110,9,115,9],[116,9,117,9],[139,2,144,2],[145,2,152,2],[128,2,138,2],[39,9,43,9],[44,9,51,9],[53,9,56,9]]}
[]
[]
[]
[null,null,"Élément","Critères",null,"S/O","Absent","Présent mais non optimal","Présent et fonctionnel","Moyenne de l’élément","Commentaires (le cas échéant)","Absent","Present","Optimal","Average","Sustainability Single Figure"]
[null,null,"Ciblage et planification"]
[null,null,"Plans de travail pour la mise en œuvre",null,"Politique et plans de travail",null,null,null,null,null,null,null,null,null,{"$f":"IFERROR(ROUND(AVERAGEIF(L7:N12,\"<>0\",L7:N12),0),\"-\")","v":"-"}]
[null,null,null,"○","Des plans de travail aux niveaux national et sous-national sont en place",null,null,null,null,{"$f":"IFERROR(O6,\"-\")","v":"-"},null,{"$f":"IF(ISBLANK(G7),0,1)","v":0},{"$f":"IF(ISBLANK(H7),0,3)","v":0},{"$f":"IF(ISBLANK(I7),0,5)","v":0}]
[null,null,null,"○","Les populations cibles sont impliquées dans l’élaboration des plans de travail",null,null,null,null,null,null,{"$f":"IF(ISBLANK(G8),0,1)","v":0},{"$f":"IF(ISBLANK(H8),0,3)","v":0},{"$f":"IF(ISBLANK(I8),0,5)","v":0}]
[null,null,null,"○","Il existe une délégation claire des responsabilités et des lignes hiérarchiques",null,null,null,null,null,null,0,0,0]
[null,null,null,"○","Des calendriers et des mécanismes de rapport sont en place",null,null,null,null,null,null,0,0,0]
[null,null,null,"○","Des mécanismes d’examen et de suivi sont en place",null,null,null,null,null,null,0,0,0]
[null,null,null,"○","Les actions et éléments du programme sont clairement corrélés aux lignes budgétaires",null,null,null,null,null,null,0,0,0]
[null,null,"Évaluation de la population à risque","○","Les populations prioritaires sont déterminées par le profil épidémique du VIH, l’incidence et la prévalence du VIH et la distribution géographique du risque",null,null,null,null,{"$f":"IFERROR(O13,\"-\")","v":"-"},null,0,0,0,{"$f":"IFERROR(ROUND(AVERAGEIF(L13:N17,\"<>0\",L13:N17),0),\"-\")","v":"-"}]
[null,null,null,"○","Implication de membres de groupes prioritaires et de groupes de population clés dans l’évaluation des populations à risque",null,null,null,null,null,null,0,0,0]
[null,null,null,"○","L’évaluation du lieu et du mode de mise à l’échelle du déploiement est pratiquée à l’aide d’outils disponibles dans le monde entier (ex. : OPTIONS Plan4PrEP Toolkit, PrEP-It, WHO Implementation Toolkit for PrEP)",null,null,null,null,null,null,0,0,0]
[null,null,null,"○","L’approche est non stigmatisante -– les documents destinés au public évoquent des comportements à haut risque sans nommer de populations clés",null,null,null,null,null,null,0,0,0]
[null,null,null,"○","Au niveau infranational, les données sont ventilées par sexe, population clé et âge (avec des tranches d’âge plus petites pour les populations plus jeunes, à savoir 15-19 ans, 20-24 ans, 25-29 ans, etc.)",null,null,null,null,null,null,0,0,0]
[null,null," Cibles des indicateurs","○","Des cibles pour les indicateurs de résultats du programme ont été fixées aux niveaux national et infranational",null,null,null,null,{"$f":"IFERROR(O18,\"-\")","v":"-"},null,0,0,0,{"$f":"IFERROR(ROUND(AVERAGEIF(L18:N26,\"<>0\",L18:N26),0),\"-\")","v":"-"}]
[null,null,null,"○","Les cibles sont basées sur l’incidence et la prévalence du VIH aux niveaux national et infranational et sur l’évaluation de la population à risque",null,null,null,null,null,null,0,0,0]
[null,null,null,"○","Les cibles sont informées par des données de mise en œuvre dans le pays (ex. : études de démonstration, le cas échéant)",null,null,null,null,null,null,0,0,0]
{"$rows_left_out":138}
{"sheet":"Résultats de programme ","index":7,"n_rows":37,"n_cols":15,"rows_kept":37,"cut":false,"hidden":false,"merged":[[27,9,32,9],[1,2,1,8],[5,9,10,9],[11,9,15,9],[16,9,20,9],[21,9,26,9],[5,2,10,2],[11,2,15,2],[16,2,20,2],[21,2,26,2],[27,2,32,2]]}
[]
[null,null,"Résultats de programme"]
[]
[null,null,"Élément","Critères",null,"S/O","Absent","Présent mais non optimal","Présent et fonctionnel","Moyenne de l’élément","Commentaires\n(le cas échéant)","Absent","Present","Optimal","Average"]
[null,null,"Résultats et indicateurs"]
[null,null,"Utilisation de la PaE","○","Des indicateurs d’utilisation de la PaE pour toutes les modalités de PaE disponibles (PaE orale, anneau, préparations injectables à action prolongée) sont en place",null,null,null,null,{"$f":"IFERROR(O6,\"-\")","v":"-"},null,{"$f":"IF(ISBLANK(G6),0,1)","v":0},{"$f":"IF(ISBLANK(H6),0,3)","v":0},{"$f":"IF(ISBLANK(I6),0,5)","v":0},{"$f":"IFERROR(ROUND(AVERAGEIF(L6:N11,\"<>0\",L6:N11),0),\"-\")","v":"-"}]
[null,null,null,"○","Les indicateurs sont définis comme suit : pourcentage de personnes éligibles qui ont initié [modalité de PaE sélectionnée] pendant la période de référence",null,null,null,null,null,null,{"$f":"IF(ISBLANK(G7),0,1)","v":0},{"$f":"IF(ISBLANK(H7),0,3)","v":0},{"$f":"IF(ISBLANK(I7),0,5)","v":0}]
[null,null,null,"○","Les données de l’indicateur d’utilisation de la PaE sont collectées trimestriellement",null,null,null,null,null,null,0,0,0]
[null,null,null,"○","Les données de [modalité de PaE sélectionnée] sont ventilées par sexe, population clé, unité géographique et âge (avec des tranches d’âge plus petites pour les populations plus jeunes, à savoir 15-19 ans, 20-24 ans, 25-29 ans, etc.)",null,null,null,null,null,null,0,0,0]
[null,null,null,"○","Les indicateurs pour [modalité de PaE sélectionnée] sont ventilés selon qu’il s’agit d’une première utilisation ou d’une utilisation répétée de la PaE",null,null,null,null,null,null,0,0,0]
[null,null,null,"○","La cible définie au niveau national (c’est-à-dire trimestrielle ou annuelle) est atteinte",null,null,null,null,null,null,0,0,0]
[null,null,"Poursuite de la PaE","○","Des indicateurs de poursuite de la PaE pour toutes les modalités de PaE disponibles (PaE orale, anneau, préparations injectables à action prolongée) sont en place",null,null,null,null,{"$f":"IFERROR(O12,\"-\")","v":"-"},null,0,0,0,{"$f":"IFERROR(ROUND(AVERAGEIF(L12:N16,\"<>0\",L12:N16),0),\"-\")","v":"-"}]
[null,null,null,"○","Les indicateurs sont définis comme suit : pourcentage d’utilisateurs de [sélectionner la modalité de PaE] qui ont poursuivi [modalité de PaE sélectionnée] pendant 3 mois consécutifs après l’avoir initiée pendant la période de référence",null,null,null,null,null,null,0,0,0]
[null,null,null,"○","Les données de l’indicateur de poursuite de la PaE sont collectées trimestriellement",null,null,null,null,null,null,0,0,0]
[null,null,null,"○","Les données de [modalité de PaE sélectionnée] sont ventilées par sexe, population clé, unité géographique et âge (avec des tranches d’âge plus petites pour les populations plus jeunes, à savoir 15-19 ans, 20-24 ans, 25-29 ans, etc.)",null,null,null,null,null,null,0,0,0]
[null,null,null,"○","La cible définie au niveau national (c’est-à-dire trimestrielle ou annuelle) est atteinte",null,null,null,null,null,null,0,0,0]
[null,null,"PaE en cours","○","Des indicateurs de PaE en cours pour toutes les modalités de PaE disponibles (PaE orale, anneau, préparations injectables à action prolongée) sont en place",null,null,null,null,{"$f":"IFERROR(O17,\"-\")","v":"-"},null,0,0,0,{"$f":"IFERROR(ROUND(AVERAGEIF(L17:N21,\"<>0\",L17:N21),0),\"-\")","v":"-"}]
[null,null,null,"○","Les indicateurs sont définis comme suit : nombre de personnes ayant reçu [sélectionner la modalité de PaE] au moins une fois pendant la période de référence",null,null,null,null,null,null,0,0,0]
[null,null,null,"○","Les données de l’indicateur de PaE en cours sont collectées trimestriellement",null,null,null,null,null,null,0,0,0]
[null,null,null,"○","Les indicateurs de [modalité de PaE sélectionnée] sont ventilés par sexe, population clé, unité géographique et âge (avec des tranches d’âge plus petites pour les populations plus jeunes, à savoir 15-19 ans, 20-24 ans, 25-29 ans, etc.)",null,null,null,null,null,null,0,0,0]
{"$rows_left_out":18}
{"sheet":"Résumé des notes","index":8,"n_rows":41,"n_cols":11,"rows_kept":41,"cut":false,"hidden":false,"merged":[[29,2,35,2],[25,3,28,3],[8,3,11,3],[12,3,14,3],[15,3,18,3],[19,3,20,3],[29,3,33,3],[1,2,1,6],[2,3,4,3],[5,3,6,3],[2,2,7,2],[21,3,24,3],[8,2,28,2]]}
[]
[null,null,"Résumé des notes"]
[null,null,"Gestion de \nprogramme","Stratégie, politique et réglementation",null,"Stratégie nationale de prévention du VIH",{"$f":"'Gestion de programme'!O6","v":"-"}]
[null,null,null,null,null,"Directives cliniques nationales",{"$f":"'Gestion de programme'!O12","v":"-"}]
[null,null,null,null,null,"Statut réglementaire des médicaments associés à la PaE",{"$f":"'Gestion de programme'!O21","v":"-"}]
[null,null,null,"Leadership et coordination",null,"Leadership et obligation de rendre compte",{"$f":"'Gestion de programme'!O25","v":"-"}]
[null,null,null,null,null,"Engagement des parties prenantes",{"$f":"'Gestion de programme'!O28","v":"-"}]
[null,null,null,"Financement",null,"Budget",{"$f":"'Gestion de programme'!O35","v":"-"}]
[null,null,"Mise en œuvre de programme","Ciblage et planification",null,"Plans de travail pour la mise en œuvre",{"$f":"'Mise en œuvre de programme'!O6","v":"-"}]
[null,null,null,null,null,"Évaluation de la population à risque",{"$f":"'Mise en œuvre de programme'!O13","v":"-"}]
[null,null,null,null,null,"Cibles des indicateurs",{"$f":"'Mise en œuvre de programme'!O18","v":"-"}]
[null,null,null,null,null,"Stratégie de communication",{"$f":"'Mise en œuvre de programme'!O27","v":"-"}]
[null,null,null,"Approvisionnement",null,"Quantification des produits de base nécessaires",{"$f":"'Mise en œuvre de programme'!O36","v":"-"}]
[null,null,null,null,null,"Plan d’approvisionnement en produits de base",{"$f":"'Mise en œuvre de programme'!O40","v":"-"}]
[null,null,null,null,null,"Chaîne d’approvisionnement/SIGL",{"$f":"'Mise en œuvre de programme'!O45","v":"-"}]
[null,null,null,"Prestation de services",null,"Différenciés",{"$f":"'Mise en œuvre de programme'!O54","v":"-"}]
[null,null,null,null,null,"Intégrés",{"$f":"'Mise en œuvre de programme'!O58","v":"-"}]
[null,null,null,null,null,"Accessibles",{"$f":"'Mise en œuvre de programme'!O64","v":"-"}]
[null,null,null,null,null,"Acceptables",{"$f":"'Mise en œuvre de programme'!O68","v":"-"}]
[null,null,null,"Assistance à la prestation de services",null,"Formation",{"$f":"'Mise en œuvre de programme'!O72","v":"-"}]
{"$rows_left_out":22}
{"sheet":"Étapes suivantes","index":9,"n_rows":54,"n_cols":8,"rows_kept":54,"cut":false,"hidden":false,"merged":[[1,2,1,8],[11,2,11,3]]}
[]
[null,null,"Étapes suivantes"]
[]
[null,null,null,null,null,"Élément à traiter/améliorer","Raison de la mauvaise performance","Actions proposées (ex. : soutien requis ou actions correctives)."]
[null,null,null,null,1,{"$f":"IFERROR(INDEX('Résumé des notes'!$F$1:$F$93,SMALL(IF('Résumé des notes'!$G$1:$G$93<=$C$12,ROW('Résumé des notes'!$G$1:$G$93)),ROW(3:3))),\"\")","v":0}]
[null,null,null,null,2,{"$f":"IFERROR(INDEX('Résumé des notes'!$F$1:$F$93,SMALL(IF('Résumé des notes'!$G$1:$G$93<=$C$12,ROW('Résumé des notes'!$G$1:$G$93)),ROW(4:4))),\"\")","v":0}]
[null,null,null,null,3,{"$f":"IFERROR(INDEX('Résumé des notes'!$F$1:$F$93,SMALL(IF('Résumé des notes'!$G$1:$G$93<=$C$12,ROW('Résumé des notes'!$G$1:$G$93)),ROW(5:5))),\"\")","v":0}]
[null,null,null,null,4,{"$f":"IFERROR(INDEX('Résumé des notes'!$F$1:$F$93,SMALL(IF('Résumé des notes'!$G$1:$G$93<=$C$12,ROW('Résumé des notes'!$G$1:$G$93)),ROW(6:6))),\"\")","v":0}]
[null,null,null,null,5,{"$f":"IFERROR(INDEX('Résumé des notes'!$F$1:$F$93,SMALL(IF('Résumé des notes'!$G$1:$G$93<=$C$12,ROW('Résumé des notes'!$G$1:$G$93)),ROW(7:7))),\"\")","v":0}]
[null,null,null,null,6,{"$f":"IFERROR(INDEX('Résumé des notes'!$F$1:$F$93,SMALL(IF('Résumé des notes'!$G$1:$G$93<=$C$12,ROW('Résumé des notes'!$G$1:$G$93)),ROW(8:8))),\"\")","v":0}]
[null,null,null,null,7,{"$f":"IFERROR(INDEX('Résumé des notes'!$F$1:$F$93,SMALL(IF('Résumé des notes'!$G$1:$G$93<=$C$12,ROW('Résumé des notes'!$G$1:$G$93)),ROW(9:9))),\"\")","v":0}]
[null,null,null,null,8,{"$f":"IFERROR(INDEX('Résumé des notes'!$F$1:$F$93,SMALL(IF('Résumé des notes'!$G$1:$G$93<=$C$12,ROW('Résumé des notes'!$G$1:$G$93)),ROW(10:10))),\"\")","v":0}]
[null,null,null,null,9,{"$f":"IFERROR(INDEX('Résumé des notes'!$F$1:$F$93,SMALL(IF('Résumé des notes'!$G$1:$G$93<=$C$12,ROW('Résumé des notes'!$G$1:$G$93)),ROW(11:11))),\"\")","v":0}]
[null,null,null,null,10,{"$f":"IFERROR(INDEX('Résumé des notes'!$F$1:$F$93,SMALL(IF('Résumé des notes'!$G$1:$G$93<=$C$12,ROW('Résumé des notes'!$G$1:$G$93)),ROW(12:12))),\"\")","v":0}]
[null,null,null,null,11,{"$f":"IFERROR(INDEX('Résumé des notes'!$F$1:$F$93,SMALL(IF('Résumé des notes'!$G$1:$G$93<=$C$12,ROW('Résumé des notes'!$G$1:$G$93)),ROW(13:13))),\"\")","v":0}]
[null,null,null,null,12,{"$f":"IFERROR(INDEX('Résumé des notes'!$F$1:$F$93,SMALL(IF('Résumé des notes'!$G$1:$G$93<=$C$12,ROW('Résumé des notes'!$G$1:$G$93)),ROW(14:14))),\"\")","v":0}]
[null,null,null,null,13,{"$f":"IFERROR(INDEX('Résumé des notes'!$F$1:$F$93,SMALL(IF('Résumé des notes'!$G$1:$G$93<=$C$12,ROW('Résumé des notes'!$G$1:$G$93)),ROW(15:15))),\"\")","v":0}]
[null,null,null,null,14,{"$f":"IFERROR(INDEX('Résumé des notes'!$F$1:$F$93,SMALL(IF('Résumé des notes'!$G$1:$G$93<=$C$12,ROW('Résumé des notes'!$G$1:$G$93)),ROW(16:16))),\"\")","v":0}]
[null,null,null,null,15,{"$f":"IFERROR(INDEX('Résumé des notes'!$F$1:$F$93,SMALL(IF('Résumé des notes'!$G$1:$G$93<=$C$12,ROW('Résumé des notes'!$G$1:$G$93)),ROW(17:17))),\"\")","v":0}]
[null,null,null,null,16,{"$f":"IFERROR(INDEX('Résumé des notes'!$F$1:$F$93,SMALL(IF('Résumé des notes'!$G$1:$G$93<=$C$12,ROW('Résumé des notes'!$G$1:$G$93)),ROW(18:18))),\"\")","v":0}]
{"$rows_left_out":35}
{"sheet":"Bibliographie","index":10,"n_rows":29,"n_cols":4,"rows_kept":29,"cut":false,"hidden":false,"merged":[[1,2,1,3]]}
[]
[null,null,"Bibliographie"]
[null,null,1,"CDC (2017). PrEP Guidelines: CDC provider supplement"]
[null,null,2,"WHO (2016).Consolidated guidelines on the use of antiretroviral drugs for treating and preventing HIV infection"]
[null,null,3,"WHO (2017). Implementation tool for pre-exposure prophylaxis of HIV infection"]
[null,null,4,"OPTIONS (2019). Provider training package: Effective delivery of oral PrEP for adolescent girls and young women"]
[null,null,5,"OPTIONS (2019). PrEP-it tool"]
[null,null,6,"WHO (2016). Recommendations for a public health approach - Second edition"]
[null,null,7,"UNAIDS (2017). HIV Prevention 2020 Road Map"]
[null,null,8,"USAID (2005). Guidelines for managing HIV supply chain"]
[null,null,9,"WHO (2015). WHO good distribution practices for pharmaceutical products"]
[null,null,10,"WHO (2017). WHO implementation tool for pre-exposure prophylaxis of HIV infection"]
[null,null,11,"WHO (2019) What’s the 2+1+1? Event-driven oral pre-exposure prophylaxis to prevent HIV for men who have sex with men: Update to WHO’s recommendation on oral PrEP"]
[null,null,12,"WHO (2021) Updated recommendations on HIV prevention, infant diagnosis, antiretroviral initiation and monitoring"]
[null,null,13,"WHO (2020) HIV drug resistance surveillance in countries scaling up pre-exposure prophylaxis"]
[null,null,14,"WHO (2020) Consolidated HIV strategic information guidelines: driving impact through programme monitoring and management"]
[null,null,15,"PEPFAR (2020) Monitoring, Evaluation, and Reporting Indicator Reference Guide - MER 2.0 (Version 2.5)"]
[null,null,16,"WHO (2019) Prevention and control of sexually transmitted infections (STIs) in the era of oral pre-exposure prophylaxis (PrEP) for HIV"]
[null,null,17,"UNAIDS End Inequalities. End AIDS. Global AIDS Strategy 2021-2026"]
[null,null,18,"WHO (2018) Implementation tool for pre-exposure prophylaxis (PrEP) of HIV infection. Module 12: Adolescents and young adults"]
{"$rows_left_out":10}
{"sheet":"Acronymes","index":11,"n_rows":39,"n_cols":4,"rows_kept":39,"cut":false,"hidden":false,"merged":[[1,2,1,3]]}
[]
[null,null,"Acronymes"]
[]
[null,null,"AJF","Adolescentes et jeunes femmes "]
[null,null,"ARV","Médicaments antirétroviraux"]
[null,null,"AT","Plan d’assistance technique"]
[null,null,"AVD","Anneau vaginal de dapivirine"]
[null,null,"CDV","Conseil et dépistage du VIH"]
[null,null,"ClCr","Test de clairance de la créatine"]
[null,null,"CMMV","Circoncision masculine médicale volontaire"]
[null,null,"CV","Charge virale"]
[null,null,"EI","Événement indésirable"]
[null,null,"EIG","Événement indésirable grave "]
[null,null,"GTT","Groupe de travail technique "]
[null,null,"HSH","Hommes ayant rapports sexuels avec des hommes "]
[null,null,"ICP","Information et communication pédagogique"]
[null,null,"IST ","Infection sexuellement transmissible"]
[null,null,"LME","Liste des médicaments essentiels"]
[null,null,"OAEP","Outil d’auto-évaluation de la prévention"]
[null,null,"OMS","Organisation mondiale de la Santé "]
{"$rows_left_out":19}