{"text_format":"1","workbook":"xlsx","n_sheets":12,"sheets":["Summary of scores (2)","Introduction","Instructions","FAQs","Guidance for PrEP","Programme Management","Programme Implementation","Programme Outcomes ","Summary of scores","Next steps","Bibliography","Acronyms"],"not_rendered":{"charts":6,"images":1,"macros":1,"external_links":0,"defined_names":28,"comments":1,"pivot_tables":0},"unopened":[],"bounds":{"document_bytes":16777216,"sheet_cells":100000,"rows_first":2000,"rows_last":500,"rows_between":2000,"halvings":0,"cell_chars":16384,"cell_head_chars":4096},"cells_cut":0,"cells_raw":0,"read":"whole","date_system":"1900"}

{"sheet":"Summary of scores (2)","index":0,"n_rows":142,"n_cols":6,"rows_kept":142,"cut":false,"hidden":true,"merged":[[74,3,75,3],[2,2,67,2],[2,3,23,3],[24,3,45,3],[46,3,67,3],[109,2,141,2],[109,3,136,3],[137,3,141,3],[1,2,1,6],[68,2,74,2],[68,3,71,3],[72,3,73,3],[76,2,108,2],[93,3,97,3],[99,3,100,3],[101,3,108,3],[76,3,79,3],[80,3,82,3],[83,3,86,3],[87,3,89,3],[90,3,92,3]]}
[]
[null,null,"Summary of scores"]
[null,null,"Prevention\nPackages","AGYW Prevention Package\n(HIGH Incidence Locations)",null,"Risk Assessment / Profiling"]
[null,null,null,null,null,"Male and female condoms and lubricants "]
[null,null,null,null,null,"HIV testing, treatment, counselling and support"]
[null,null,null,null,null,"Pre-exposure Prophylaxis"]
[null,null,null,null,null,"STI diagnosis & service integration"]
[null,null,null,null,null,"SRH services incl. contraceptive mix"]
[null,null,null,null,null,"GBV services, post-rape care "]
[null,null,null,null,null,"Antenatal care (ANC) including PMTCT"]
[null,null,null,null,null,"Clinical service package for sex partners of AGYW"]
[null,null,null,null,null,"Accessible services"]
[null,null,null,null,null,"Youth-friendly/Acceptable services"]
[null,null,null,null,null,"Sensitisation"]
[null,null,null,null,null,"School-based prevention campaigns"]
[null,null,null,null,null,"Comprehensive sexuality education"]
[null,null,null,null,null,"Keeping girls in school"]
[null,null,null,null,null,"Community Mobilisation & demand generation"]
[null,null,null,null,null,"Increasing access to justice (policy and legal) "]
[null,null,null,null,null,"Gender-based violence prevention and management "]
{"$rows_left_out":123}
{"sheet":"Introduction","index":1,"n_rows":2,"n_cols":3,"rows_kept":2,"cut":false,"hidden":false,"merged":[[1,2,1,22]]}
[]
[null,null,"What are the HIV Prevention Self-Assessment Tools (PSAT)?"]

{"sheet":"Instructions","index":2,"n_rows":57,"n_cols":19,"rows_kept":57,"cut":false,"hidden":false,"merged":[[2,2,2,17]]}
[]
[]
[null,null,"How to complete the Prevention Self Assessment Tool (PSAT)"]
[]
[]
[]
[]
[]
[]
[]
[]
[]
[]
[]
[]
[]
[]
[]
[]
[]
{"$rows_left_out":38}
{"sheet":"FAQs","index":3,"n_rows":2,"n_cols":3,"rows_kept":2,"cut":false,"hidden":false,"merged":[[1,2,1,22]]}
[]
[null,null,"Frequently Asked Questions"]

{"sheet":"Guidance for PrEP","index":4,"n_rows":2,"n_cols":3,"rows_kept":2,"cut":false,"hidden":false,"merged":[[1,2,1,22]]}
[]
[null,null,"Offering Pre Exposure Prophylaxis"]

{"sheet":"Programme Management","index":5,"n_rows":48,"n_cols":16,"rows_kept":48,"cut":false,"hidden":false,"merged":[[1,2,1,9],[3,3,3,4],[4,2,4,10],[6,9,10,9],[11,9,19,9],[5,2,10,2],[11,2,19,2],[20,2,22,2],[33,2,33,10],[34,2,42,2],[20,9,22,9],[24,9,26,9],[27,9,32,9],[34,9,42,9],[24,2,26,2],[27,2,32,2],[23,2,23,10]]}
[]
[null,null,"Programme Management"]
[]
[null,null,"Element","Criteria",null,"N/A","Absent","Present but not optimal","Present and working well","Average for element","Comments (if applicable)","Absent","Present","Optimal","Average","Sustainability Single Figure"]
[null,null,"Strategy, Policy, and Regulation"]
[null,null,"National HIV Prevention Strategy","○","PrEP as part of comprehensive HIV prevention in National HIV Strategy",null,null,null,null,null,null,{"$f":"IF(ISBLANK(G6),0,1)","v":0},{"$f":"IF(ISBLANK(H6),0,3)","v":0},{"$f":"IF(ISBLANK(I6),0,5)","v":0},{"$f":"IFERROR(ROUND(AVERAGEIF(L6:N11,\"<>0\",L6:N11),0),\"-\")","v":"-"}]
[null,null,null,"○","Oral PrEP and long-acting PrEP (i.e. DVR and injectables) are included as part of comprehensive HIV prevention in National HIV Strategy",null,null,null,null,{"$f":"IFERROR(O6,\"-\")","v":"-"},null,{"$f":"IF(ISBLANK(G7),0,1)","v":0},{"$f":"IF(ISBLANK(H7),0,3)","v":0},{"$f":"IF(ISBLANK(I7),0,5)","v":0}]
[null,null,null,"○","There is sufficient detail to guide implementation of PrEP programs",null,null,null,null,null,null,0,0,0]
[null,null,null,"○","Vision for PrEP roll out based on WHO guidance or in-country experience",null,null,null,null,null,null,0,0,0]
[null,null,null,"○","PrEP program integrated into routine health system",null,null,null,null,null,null,0,0,0,null,{"$f":"IF(MAX(L10:N10)=0,\"\",MAX(L10:N10))","v":""}]
[null,null,null,"○","PrEP is available for all those at substantial risk   ",null,null,null,null,null,null,0,0,0]
[null,null,"National Clinical Guidelines","○","National PrEP clinical guidelines are in place OR PrEP guidance is included in National ARV Guidelines ",null,null,null,null,{"$f":"IFERROR(O12,\"-\")","v":"-"},null,0,0,0,{"$f":"IFERROR(ROUND(AVERAGEIF(L12:N20,\"<>0\",L12:N20),0),\"-\")","v":"-"}]
[null,null,null,"○","There is sufficient detail to direct PrEP providers in one or more of the following areas: eligibility screening and initiation, laboratory testing, monitoring schedule, counselling",null,null,null,null,null,null,0,0,0]
[null,null,null,"○","Guidelines have approval or buy-in from provider associations",null,null,null,null,null,null,0,0,0]
[null,null,null,"○","Guidelines include guidance on who can provide PrEP and required training",null,null,null,null,null,null,0,0,0]
[null,null,null,"○","Guidelines informed by WHO guidelines and in-country experience ",null,null,null,null,null,null,0,0,0]
[null,null,null,"○","Applicable and available to all PrEP providers (public and private)",null,null,null,null,null,null,0,0,0]
[null,null,null,"○","Guidelines include promotion of clinical follow up for people who purchase PrEP online",null,null,null,null,null,null,0,0,0]
[null,null,null,"○","Guidelines include daily oral PrEP, event-driven PrEP, and long acting PrEP methods (i.e. DVR, injectables)",null,null,null,null,null,null,0,0,0]
[null,null,null,"○","COVID-19 infection prevention and control measures are incorporated into all HIV prevention/PrEP strategies, plans and guidelines",null,null,null,null,null,null,0,0,0]
{"$rows_left_out":29}
{"sheet":"Programme Implementation","index":6,"n_rows":157,"n_cols":16,"rows_kept":157,"cut":false,"hidden":false,"merged":[[119,9,127,9],[128,9,138,9],[139,9,144,9],[145,9,152,9],[17,2,25,2],[80,9,90,9],[91,9,99,9],[100,9,109,9],[110,9,115,9],[116,9,117,9],[139,2,144,2],[145,2,152,2],[128,2,138,2],[39,9,43,9],[44,9,51,9],[53,9,56,9],[12,9,16,9],[17,9,25,9],[26,9,33,9],[35,9,38,9],[5,9,11,9],[57,9,62,9],[63,9,66,9],[67,9,69,9],[71,9,76,9],[91,2,99,2],[57,2,62,2],[63,2,66,2],[77,9,79,9],[100,2,109,2],[110,2,115,2],[116,2,117,2],[119,2,127,2],[1,2,1,7],[67,2,69,2],[71,2,76,2],[77,2,79,2],[80,2,90,2],[5,2,11,2],[12,2,16,2],[26,2,33,2],[35,2,38,2],[39,2,43,2],[44,2,51,2],[53,2,56,2]]}
[]
[]
[]
[null,null,"Element","Criteria",null,"N/A","Absent","Present but not optimal","Present and working well","Average for element","Comments (if applicable)","Absent","Present","Optimal","Average","Sustainability Single Figure"]
[null,null,"Targeting and Planning"]
[null,null,"Implementation Work Plans",null,"Policy and Work plans",null,null,null,null,{"$f":"IFERROR(O6,\"-\")","v":"-"},null,null,null,null,{"$f":"IFERROR(ROUND(AVERAGEIF(L7:N12,\"<>0\",L7:N12),0),\"-\")","v":"-"}]
[null,null,null,"○","National and subnational level work plans are in place",null,null,null,null,null,null,{"$f":"IF(ISBLANK(G7),0,1)","v":0},{"$f":"IF(ISBLANK(H7),0,3)","v":0},{"$f":"IF(ISBLANK(I7),0,5)","v":0}]
[null,null,null,"○","Target populations are involved in the development of the workplans",null,null,null,null,null,null,{"$f":"IF(ISBLANK(G8),0,1)","v":0},{"$f":"IF(ISBLANK(H8),0,3)","v":0},{"$f":"IF(ISBLANK(I8),0,5)","v":0}]
[null,null,null,"○","There is clear delegation of responsibilities and reporting lines",null,null,null,null,null,null,0,0,0]
[null,null,null,"○","Timelines and reporting mechanisms are in place",null,null,null,null,null,null,0,0,0]
[null,null,null,"○","Review and monitoring mechanisms are in place",null,null,null,null,null,null,0,0,0]
[null,null,null,"○","Actions and programme elements have clear link to budget lines",null,null,null,null,null,null,0,0,0]
[null,null,"Assessment of Population at Risk","○","Priority populations are determined by HIV epidemic profile, HIV incidence, prevalence, and geographic distribution of risk",null,null,null,null,{"$f":"IFERROR(O13,\"-\")","v":"-"},null,0,0,0,{"$f":"IFERROR(ROUND(AVERAGEIF(L13:N17,\"<>0\",L13:N17),0),\"-\")","v":"-"}]
[null,null,null,"○","Involvement of priority and key population group members in assessment of populations at risk             ",null,null,null,null,null,null,0,0,0]
[null,null,null,"○","Assessment of where and how to scale up rollout is done using globally available tools (e.g. OPTIONS Plan4PrEP Toolkit, PrEP-It, WHO Implementation Toolkit for PrEP)        ",null,null,null,null,null,null,0,0,0]
[null,null,null,"○","Approach is non-stigmatizing - public facing documents refer to high risk behaviours and do not name key populations         ",null,null,null,null,null,null,0,0,0]
[null,null,null,"○","At the subnational level data is disaggregated by gender, key population, and age (with smaller age bands for younger populations i.e. 15-19., 20-24, 25-29, etc)",null,null,null,null,null,null,0,0,0]
[null,null," Indicator Targets","○","Targets for programme outcome indicators have been set at national and subnational levels",null,null,null,null,{"$f":"IFERROR(O18,\"-\")","v":"-"},null,0,0,0,{"$f":"IFERROR(ROUND(AVERAGEIF(L18:N26,\"<>0\",L18:N26),0),\"-\")","v":"-"}]
[null,null,null,"○","Targets are based on national and subnational HIV incidence and prevalence and assessment of population at risk",null,null,null,null,null,null,0,0,0]
[null,null,null,"○","Targets are informed by in-country implementation data (e.g. demonstration studies if applicable)",null,null,null,null,null,null,0,0,0]
{"$rows_left_out":138}
{"sheet":"Programme Outcomes ","index":7,"n_rows":37,"n_cols":15,"rows_kept":37,"cut":false,"hidden":false,"merged":[[27,9,32,9],[1,2,1,8],[5,9,10,9],[11,9,15,9],[16,9,20,9],[21,9,26,9],[5,2,10,2],[11,2,15,2],[16,2,20,2],[21,2,26,2],[27,2,32,2]]}
[]
[null,null,"Programme Outcomes"]
[]
[null,null,"Element","Criteria",null,"N/A","Absent","Present but not optimal","Present and working well","Average for element","Comments (if applicable)","Absent","Present","Optimal","Average"]
[null,null,"Outcomes and indicators"]
[null,null,"PrEP uptake","○","PrEP uptake indicators for all available PrEP modalities (oral PrEP, ring, long-acting injectables) are in place",null,null,null,null,{"$f":"IFERROR(O6,\"-\")","v":"-"},null,{"$f":"IF(ISBLANK(G6),0,1)","v":0},{"$f":"IF(ISBLANK(H6),0,3)","v":0},{"$f":"IF(ISBLANK(I6),0,5)","v":0},{"$f":"IFERROR(ROUND(AVERAGEIF(L6:N11,\"<>0\",L6:N11),0),\"-\")","v":"-"}]
[null,null,null,"○","Indicators are defined as: % of eligible people who initiated [selected PrEP modality] during the reporting period                            ",null,null,null,null,null,null,{"$f":"IF(ISBLANK(G7),0,1)","v":0},{"$f":"IF(ISBLANK(H7),0,3)","v":0},{"$f":"IF(ISBLANK(I7),0,5)","v":0}]
[null,null,null,"○","PrEP uptake indicator data is collected quarterly",null,null,null,null,null,null,0,0,0]
[null,null,null,"○","Indicators for [selected PrEP modality] are disaggregated by gender, key population, geographic unit, and age (with smaller age bands for younger populations i.e. 15-19., 20-24, 25-29, etc)                                    ",null,null,null,null,null,null,0,0,0]
[null,null,null,"○","Indicators for [selected PrEP modality] are disaggregated by first time and repeat PrEP users",null,null,null,null,null,null,0,0,0]
[null,null,null,"○","Nationally defined target (i.e. quarterly, annual) is met",null,null,null,null,null,null,0,0,0]
[null,null,"PrEP continuation","○","PrEP continuation indicators for all available PrEP modalities (oral PrEP, ring, long-acting injectables) are in place",null,null,null,null,{"$f":"IFERROR(O12,\"-\")","v":"-"},null,0,0,0,{"$f":"IFERROR(ROUND(AVERAGEIF(L12:N16,\"<>0\",L12:N16),0),\"-\")","v":"-"}]
[null,null,null,"○","Indicators are defined as: % of [select PrEP modality] users who continued [selected PrEP modality] for 3 consecutive months after having initiated during the reporting period              ",null,null,null,null,null,null,0,0,0]
[null,null,null,"○","PrEP continuation indicator data is collected quarterly",null,null,null,null,null,null,0,0,0]
[null,null,null,"○","Indicators for [selected PrEP modality] are disaggregated by gender, key population, geographic unit, and age (with smaller age bands for younger populations i.e. 15-19., 20-24, 25-29, etc)                                       ",null,null,null,null,null,null,0,0,0]
[null,null,null,"○","Nationally defined target (i.e. quarterly, annual) is met",null,null,null,null,null,null,0,0,0]
[null,null,"PrEP current","○","Currently on PrEP indicators for all available  PrEP modalities (oral PrEP, ring, long-acting injectables) are in place",null,null,null,null,{"$f":"IFERROR(O17,\"-\")","v":"-"},null,0,0,0,{"$f":"IFERROR(ROUND(AVERAGEIF(L17:N21,\"<>0\",L17:N21),0),\"-\")","v":"-"}]
[null,null,null,"○","Indicators are defined as: number of people who received [select PrEP modality] at least once during the reporting period",null,null,null,null,null,null,0,0,0]
[null,null,null,"○","Currently on PrEP indicator data is collected quarterly",null,null,null,null,null,null,0,0,0]
[null,null,null,"○","Indicators for [selected PrEP modality] are disaggregated by gender, key population, geographic unit, and age (with smaller age bands for younger populations i.e. 15-19., 20-24, 25-29, etc)                                        age, sex, geographic unit and may be disaggregated by priority population",null,null,null,null,null,null,0,0,0]
{"$rows_left_out":18}
{"sheet":"Summary of scores","index":8,"n_rows":41,"n_cols":11,"rows_kept":41,"cut":false,"hidden":false,"merged":[[1,2,1,6],[2,3,4,3],[5,3,6,3],[2,2,7,2],[21,3,24,3],[8,2,28,2],[29,2,35,2],[25,3,28,3],[8,3,11,3],[12,3,14,3],[15,3,18,3],[19,3,20,3],[29,3,33,3]]}
[]
[null,null,"Summary of scores"]
[null,null,"Programme \nManagement","Strategy, policy, & regulation",null,"National HIV prevention strategy",{"$f":"'Programme Management'!O6","v":"-"}]
[null,null,null,null,null,"National Clinical Guidelines",{"$f":"'Programme Management'!O12","v":"-"}]
[null,null,null,null,null,"PrEP drug regulatory status",{"$f":"'Programme Management'!O21","v":"-"}]
[null,null,null,"Leadership & coordination",null,"Leadership & accountability",{"$f":"'Programme Management'!O25","v":"-"}]
[null,null,null,null,null,"Stakeholder engagement",{"$f":"'Programme Management'!O28","v":"-"}]
[null,null,null,"Financing",null,"Budget",{"$f":"'Programme Management'!O35","v":"-"}]
[null,null,"Programme Implementation","Targeting & planning",null,"Implementation work plans",{"$f":"'Programme Implementation'!O6","v":"-"}]
[null,null,null,null,null,"Assessment of population at risk",{"$f":"'Programme Implementation'!O13","v":"-"}]
[null,null,null,null,null,"Indicator targets",{"$f":"'Programme Implementation'!O18","v":"-"}]
[null,null,null,null,null,"Communication strategy",{"$f":"'Programme Implementation'!O27","v":"-"}]
[null,null,null,"Supply",null,"Quantification of commodities need",{"$f":"'Programme Implementation'!O36","v":"-"}]
[null,null,null,null,null,"Commodity procurement plan",{"$f":"'Programme Implementation'!O40","v":"-"}]
[null,null,null,null,null,"Supply chain/LMIS",{"$f":"'Programme Implementation'!O45","v":"-"}]
[null,null,null,"Service delivery",null,"Differentiated",{"$f":"'Programme Implementation'!O54","v":"-"}]
[null,null,null,null,null,"Integrated",{"$f":"'Programme Implementation'!O58","v":"-"}]
[null,null,null,null,null,"Accessible",{"$f":"'Programme Implementation'!O64","v":"-"}]
[null,null,null,null,null,"Acceptable",{"$f":"'Programme Implementation'!O68","v":"-"}]
[null,null,null,"Service delivery support",null,"Training",{"$f":"'Programme Implementation'!O72","v":"-"}]
{"$rows_left_out":22}
{"sheet":"Next steps","index":9,"n_rows":54,"n_cols":8,"rows_kept":54,"cut":false,"hidden":false,"merged":[[1,2,1,8],[11,2,11,3]]}
[]
[null,null,"Next Steps"]
[]
[null,null,null,null,null,"Element that needs to be addressed","Reason for low performance","Proposed actions (e.g. support required or corrective actions)."]
[null,null,null,null,1,{"$f":"IFERROR(INDEX('Summary of scores'!$F$1:$F$93,SMALL(IF('Summary of scores'!$G$1:$G$93<=$C$12,ROW('Summary of scores'!$G$1:$G$93)),ROW(3:3))),\"\")","v":0}]
[null,null,null,null,2,{"$f":"IFERROR(INDEX('Summary of scores'!$F$1:$F$93,SMALL(IF('Summary of scores'!$G$1:$G$93<=$C$12,ROW('Summary of scores'!$G$1:$G$93)),ROW(4:4))),\"\")","v":0}]
[null,null,null,null,3,{"$f":"IFERROR(INDEX('Summary of scores'!$F$1:$F$93,SMALL(IF('Summary of scores'!$G$1:$G$93<=$C$12,ROW('Summary of scores'!$G$1:$G$93)),ROW(5:5))),\"\")","v":0}]
[null,null,null,null,4,{"$f":"IFERROR(INDEX('Summary of scores'!$F$1:$F$93,SMALL(IF('Summary of scores'!$G$1:$G$93<=$C$12,ROW('Summary of scores'!$G$1:$G$93)),ROW(6:6))),\"\")","v":0}]
[null,null,null,null,5,{"$f":"IFERROR(INDEX('Summary of scores'!$F$1:$F$93,SMALL(IF('Summary of scores'!$G$1:$G$93<=$C$12,ROW('Summary of scores'!$G$1:$G$93)),ROW(7:7))),\"\")","v":0}]
[null,null,null,null,6,{"$f":"IFERROR(INDEX('Summary of scores'!$F$1:$F$93,SMALL(IF('Summary of scores'!$G$1:$G$93<=$C$12,ROW('Summary of scores'!$G$1:$G$93)),ROW(8:8))),\"\")","v":0}]
[null,null,null,null,7,{"$f":"IFERROR(INDEX('Summary of scores'!$F$1:$F$93,SMALL(IF('Summary of scores'!$G$1:$G$93<=$C$12,ROW('Summary of scores'!$G$1:$G$93)),ROW(9:9))),\"\")","v":0}]
[null,null,null,null,8,{"$f":"IFERROR(INDEX('Summary of scores'!$F$1:$F$93,SMALL(IF('Summary of scores'!$G$1:$G$93<=$C$12,ROW('Summary of scores'!$G$1:$G$93)),ROW(10:10))),\"\")","v":0}]
[null,null,null,null,9,{"$f":"IFERROR(INDEX('Summary of scores'!$F$1:$F$93,SMALL(IF('Summary of scores'!$G$1:$G$93<=$C$12,ROW('Summary of scores'!$G$1:$G$93)),ROW(11:11))),\"\")","v":0}]
[null,null,null,null,10,{"$f":"IFERROR(INDEX('Summary of scores'!$F$1:$F$93,SMALL(IF('Summary of scores'!$G$1:$G$93<=$C$12,ROW('Summary of scores'!$G$1:$G$93)),ROW(12:12))),\"\")","v":0}]
[null,null,null,null,11,{"$f":"IFERROR(INDEX('Summary of scores'!$F$1:$F$93,SMALL(IF('Summary of scores'!$G$1:$G$93<=$C$12,ROW('Summary of scores'!$G$1:$G$93)),ROW(13:13))),\"\")","v":0}]
[null,null,null,null,12,{"$f":"IFERROR(INDEX('Summary of scores'!$F$1:$F$93,SMALL(IF('Summary of scores'!$G$1:$G$93<=$C$12,ROW('Summary of scores'!$G$1:$G$93)),ROW(14:14))),\"\")","v":0}]
[null,null,null,null,13,{"$f":"IFERROR(INDEX('Summary of scores'!$F$1:$F$93,SMALL(IF('Summary of scores'!$G$1:$G$93<=$C$12,ROW('Summary of scores'!$G$1:$G$93)),ROW(15:15))),\"\")","v":0}]
[null,null,null,null,14,{"$f":"IFERROR(INDEX('Summary of scores'!$F$1:$F$93,SMALL(IF('Summary of scores'!$G$1:$G$93<=$C$12,ROW('Summary of scores'!$G$1:$G$93)),ROW(16:16))),\"\")","v":0}]
[null,null,null,null,15,{"$f":"IFERROR(INDEX('Summary of scores'!$F$1:$F$93,SMALL(IF('Summary of scores'!$G$1:$G$93<=$C$12,ROW('Summary of scores'!$G$1:$G$93)),ROW(17:17))),\"\")","v":0}]
[null,null,null,null,16,{"$f":"IFERROR(INDEX('Summary of scores'!$F$1:$F$93,SMALL(IF('Summary of scores'!$G$1:$G$93<=$C$12,ROW('Summary of scores'!$G$1:$G$93)),ROW(18:18))),\"\")","v":0}]
{"$rows_left_out":35}
{"sheet":"Bibliography","index":10,"n_rows":29,"n_cols":4,"rows_kept":29,"cut":false,"hidden":false,"merged":[[1,2,1,3]]}
[]
[null,null,"Bibliography"]
[null,null,1,"CDC (2017). PrEP Guidelines: CDC provider supplement"]
[null,null,2,"WHO (2016).Consolidated guidelines on the use of antiretroviral drugs for treating and preventing HIV infection"]
[null,null,3,"WHO (2017). Implementation tool for pre-exposure prophylaxis of HIV infection"]
[null,null,4,"OPTIONS (2019). Provider training package: Effective delivery of oral PrEP for adolescent girls and young women"]
[null,null,5,"OPTIONS (2019). PrEP-it tool"]
[null,null,6,"WHO (2016). Recommendations for a public health approach - Second edition"]
[null,null,7,"UNAIDS (2017). HIV Prevention 2020 Road Map"]
[null,null,8,"USAID (2005). Guidelines for managing HIV supply chain"]
[null,null,9,"WHO (2015). WHO good distribution practices for pharmaceutical products"]
[null,null,10,"WHO (2017). WHO implementation tool for pre-exposure prophylaxis of HIV infection"]
[null,null,11,"WHO (2019) What’s the 2+1+1? Event-driven oral pre-exposure prophylaxis to prevent HIV for men who have sex with men: Update to WHO’s recommendation on oral PrEP"]
[null,null,12,"WHO (2021) Updated recommendations on HIV prevention, infant diagnosis, antiretroviral initiation and monitoring"]
[null,null,13,"WHO (2020) HIV drug resistance surveillance in countries scaling up pre-exposure prophylaxis"]
[null,null,14,"WHO (2020) Consolidated HIV strategic information guidelines: driving impact through programme monitoring and management"]
[null,null,15,"PEPFAR (2020) Monitoring, Evaluation, and Reporting Indicator Reference Guide - MER 2.0 (Version 2.5)"]
[null,null,16,"WHO (2019) Prevention and control of sexually transmitted infections (STIs) in the era of oral pre-exposure prophylaxis (PrEP) for HIV"]
[null,null,17,"UNAIDS End Inequalities. End AIDS. Global AIDS Strategy 2021-2026"]
[null,null,18,"WHO (2018) Implementation tool for pre-exposure prophylaxis (PrEP) of HIV infection. Module 12: Adolescents and young adults"]
{"$rows_left_out":10}
{"sheet":"Acronyms","index":11,"n_rows":39,"n_cols":4,"rows_kept":39,"cut":false,"hidden":false,"merged":[[1,2,1,8]]}
[]
[null,null,"Acronyms"]
[]
[null,null,"AE","Adverse event"]
[null,null,"AGYW","Adolescent girls and young women "]
[null,null,"ANC","Antenatal care"]
[null,null,"ART","Antiretroviral therapy"]
[null,null,"ARV","Antiretroviral drugs"]
[null,null,"CrCl","Creatine clearance test"]
[null,null,"DVR","Dapivirine Vaginal Ring"]
[null,null,"EML","Essential Medicines List"]
[null,null,"FP","Family planning"]
[null,null,"FSW","Female Sex Worker"]
[null,null,"HBV","Hepatitis B virus "]
[null,null,"HCT","HIV counselling and testing"]
[null,null,"HCV","Hepatitis C virus "]
[null,null,"HMIS","Health management information system"]
[null,null,"HR","Human resources"]
[null,null,"KP","Key populations "]
[null,null,"LMIS","Logistics management information system"]
{"$rows_left_out":19}