{"text_format":"1","workbook":"xlsx","n_sheets":12,"sheets":["Outline","Introduction","Instructions","Foire aux questions","Directives pour la CMMV","Gestion de programme ","Mise en œuvre de programme ","Résultats de programme ","Résumé des notes","Étapes suivantes","Bibliographie","Acronymes"],"not_rendered":{"charts":6,"images":0,"macros":1,"external_links":0,"defined_names":19,"comments":0,"pivot_tables":0},"unopened":[],"bounds":{"document_bytes":16777216,"sheet_cells":100000,"rows_first":2000,"rows_last":500,"rows_between":2000,"halvings":0,"cell_chars":16384,"cell_head_chars":4096},"cells_cut":0,"cells_raw":0,"read":"whole","date_system":"1900"}

{"sheet":"Outline","index":0,"n_rows":46,"n_cols":6,"rows_kept":46,"cut":false,"hidden":true,"merged":[[38,0,45,0],[38,1,41,1],[42,1,45,1],[13,0,37,0],[16,1,20,1],[21,1,26,1],[27,1,29,1],[35,1,37,1],[30,1,34,1],[13,1,15,1],[0,3,1,5],[3,1,5,1],[6,1,9,1],[10,1,11,1],[3,0,12,0]]}
[]
[]
["DOMAIN","FUNCTION",{"$f":"#REF!","v":{"$error":"#REF!"}},{"$f":"#REF!","v":{"$error":"#REF!"}},"REFERENCE","REVIEWER'S COMMENTS"]
["Program Management","1. Leadership & advocacy","1.1","National MMC Strategy","A Framework for VMMC 2021 Policy Brief, WHO and UNAIDS, 2016\nJoint Strategic Action Framework to Accelerate the Scale-up of VMMC for HIV Prevention in ESA 2012-2016, WHO and UNAIDS, 2007"]
[null,null,"1.2","Champions","A Framework for VMMC 2021 Policy Brief, WHO and UNAIDS, 2016\nJoint Strategic Action Framework to Accelerate the Scale-up of VMMC for HIV Prevention in ESA 2012-2016, WHO and UNAIDS, 2008"]
[null,null,"1.3","Advocacy strategy and toolkit","A Framework for VMMC 2021 Policy Brief, WHO and UNAIDS, 2016\nJoint Strategic Action Framework to Accelerate the Scale-up of VMMC for HIV Prevention in ESA 2012-2016, WHO and UNAIDS, 2009"]
[null,"2. Coordination & accountability","2.1","National MMC Operational Plan","A Framework for VMMC 2021 Policy Brief, WHO and UNAIDS, 2016\nJoint Strategic Action Framework to Accelerate the Scale-up of VMMC for HIV Prevention in ESA 2012-2016, WHO and UNAIDS, 2010"]
[null,null,"2.2","Technical Working Group (TWG) for MMC","A Framework for VMMC 2021 Policy Brief, WHO and UNAIDS, 2016\nJoint Strategic Action Framework to Accelerate the Scale-up of VMMC for HIV Prevention in ESA 2012-2016, WHO and UNAIDS, 2011"]
[null,null,"2.3","Stakeholder coordination (including traditional sector and civil society)","A Framework for VMMC 2021 Policy Brief, WHO and UNAIDS, 2016\nJoint Strategic Action Framework to Accelerate the Scale-up of VMMC for HIV Prevention in ESA 2012-2016, WHO and UNAIDS, 2012"]
[null,null,"2.4","Coordination with other Ministries","Sustainability Transition Implementation Plan 2019 - 2021 for VMMC. Zimbabwe Ministry pf Health & Child Care"]
[null,"3. Policies & legislative environment","3.1","National MMC Implementation guidelines","South African National Guidelines for MMC, 2016, Department of Health for the Republic of South Africa\nhttps://www.who.int/hiv/pub/malecircumcision/male-circumcision-guide-2018/en/"]
[null,null,"3.2","Policy enabling environment for MMC","Manual for MMC, Chapter 2: An opportunity for expanded services for adolescent boys and men. 2018. WHO"]
[null,"4. Financing","4.1","Resource mobilization","Joint Strategic Action Framework to Accelerate the Scale-up of VMMC for HIV Prevention in ESA 2012-2016, WHO and UNAIDS, 2012\nManual for MMC, Chapter 2: An opportunity for expanded services for adolescent boys and men. 2018. WHO\nPolicy Guidelines for Sustaining Medical Male Circumcision Services in Kenya, Kenya Ministry of Health, 2018"]
["Program Implementation","5. Targeting and planning","5.1","Demographic assessment (population size estimation and mapping areas of unmet need)"]
[null,null,"5.2","Needs assessment"]
[null,null,"5.3","Target setting"]
[null,"6. Service delivery factors","6.1","Availability of services (operating hours)","Manual for MMC, Chapter 2: An opportunity for expanded services for adolescent boys and men. 2018. WHO"]
[null,null,"6.2","Accessibility of services (transportation)"]
[null,null,"6.3","Trained and capacitated healthcare workers "]
[null,null,"6.4","Facilities, supplies and infrastructure","MMC Manual, Chapter 3: Facilities, Supplies and Infrastructure for MMC Programs. WHO, 2018"]
{"$rows_left_out":27}
{"sheet":"Introduction","index":1,"n_rows":2,"n_cols":3,"rows_kept":2,"cut":false,"hidden":false,"merged":[[1,2,1,22]]}
[]
[null,null,"Que sont les Outils d’auto-évaluation pour la prévention du VIH (OAEP) ?"]

{"sheet":"Instructions","index":2,"n_rows":3,"n_cols":3,"rows_kept":3,"cut":false,"hidden":false,"merged":[[2,2,2,17]]}
[]
[]
[null,null,"Comment compléter l’OEAP"]

{"sheet":"Foire aux questions","index":3,"n_rows":2,"n_cols":2,"rows_kept":2,"cut":false,"hidden":false,"merged":[[1,1,1,21]]}
[]
[null,"Foire aux questions"]

{"sheet":"Directives pour la CMMV","index":4,"n_rows":2,"n_cols":2,"rows_kept":2,"cut":false,"hidden":false,"merged":[[1,1,1,21]]}
[]
[null,"Programme de circoncision masculine médicale volontaire"]

{"sheet":"Gestion de programme ","index":5,"n_rows":89,"n_cols":16,"rows_kept":89,"cut":false,"hidden":false,"merged":[[77,9,83,9],[50,2,54,2],[51,9,54,9],[55,2,61,2],[55,3,55,4],[55,9,61,9],[63,2,70,2],[63,9,70,9],[50,3,50,4],[71,3,71,4],[71,2,75,2],[71,9,75,9],[77,2,83,2],[77,3,77,4],[63,3,63,4],[42,2,49,2],[42,3,42,4],[42,9,49,9],[12,2,17,2],[12,3,12,4],[12,9,17,9],[18,2,27,2],[18,3,18,4],[18,9,27,9],[28,2,33,2],[28,3,28,4],[28,9,33,9],[35,2,41,2],[35,3,35,4],[35,9,41,9],[1,2,1,9],[3,3,3,4],[4,2,4,10],[5,2,11,2],[5,3,5,4],[5,9,11,9]]}
[]
[null,null,"Gestion de programme"]
[]
[null,null,"Élément","Critères",null,"S/O","Absent","Présent mais non optimal","Présent et fonctionnel","Moyenne de l’élément","Commentaires (le cas échéant)","Absent","Present","Optimal","Average","Sustainability Single Figure"]
[null,null,"Leadership et défense des intérêts"]
[null,null,"Stratégie nationale de CMMV","Des directives et objectifs stratégiques nationaux sont en place :",null,null,null,null,null,{"$f":"IFERROR(O6,\"-\")","v":"-"},null,null,null,null,{"$f":"IFERROR(ROUND(AVERAGEIF(L7:N12,\"<>0\",L7:N12),0),\"-\")","v":"-"}]
[null,null,null,"○","Les directives et objectifs stratégiques sont à jour (actualisés tous les 3 à 5 ans)",null,null,null,null,null,null,{"$f":"IF(ISBLANK(G7),0,1)","v":0},{"$f":"IF(ISBLANK(H7),0,3)","v":0},{"$f":"IF(ISBLANK(I7),0,5)","v":0}]
[null,null,null,"○","Les objectifs stratégiques sont alignés sur des normes mondiales, nationales et infranationales",null,null,null,null,null,null,0,0,0]
[null,null,null,"○","Toutes les parties prenantes s’engagent à mettre en œuvre les stratégies nationales ",null,null,null,null,null,null,0,0,0]
[null,null,null,"○","La stratégie énonce des buts et objectifs clairs pour la mise à l’échelle, avec une vision d’avenir pour la durabilité",null,null,null,null,null,null,0,0,0]
[null,null,null,"○","Il existe une forte réponse programmatique aux buts et objectifs stratégiques",null,null,null,null,null,null,0,0,0]
[null,null,null,"○","La théorie du changement identifie la contribution de chaque partie prenante et décrit les facteurs de réussite, les activités et les parties prenantes",null,null,null,null,null,null,0,0,0]
[null,null,"Champions","Des champions aux niveaux national et infranational sont identifiés, équipés et soutenus pour plaider en faveur de la CMMV : ",null,null,null,null,null,{"$f":"IFERROR(O13,\"-\")","v":"-"},null,null,0,null,{"$f":"IFERROR(ROUND(AVERAGEIF(L14:N18,\"<>0\",L14:N18),0),\"-\")","v":"-"}]
[null,null,null,"○","Ils représentent divers secteurs (santé, éducation, groupes communautaires, traditionnels ou religieux) ",null,null,null,null,null,null,{"$f":"IF(ISBLANK(G14),0,1)","v":0},{"$f":"IF(ISBLANK(H14),0,3)","v":0},{"$f":"IF(ISBLANK(I14),0,5)","v":0}]
[null,null,null,"○","Ils reçoivent des informations leur permettant de plaider efficacement en faveur de la CMMV",null,null,null,null,null,null,{"$f":"IF(ISBLANK(G15),0,1)","v":0},{"$f":"IF(ISBLANK(H15),0,3)","v":0},{"$f":"IF(ISBLANK(I15),0,5)","v":0}]
[null,null,null,"○","Ils participent à des réunions exclusives pour discuter de bonnes pratiques et faire le point sur les progrès accomplis",null,null,null,null,null,null,{"$f":"IF(ISBLANK(G16),0,1)","v":0},{"$f":"IF(ISBLANK(H16),0,3)","v":0},{"$f":"IF(ISBLANK(I16),0,5)","v":0}]
[null,null,null,"○","Ils reçoivent une formation de sensibilisation et un soutien de la part du programme local de CMMV",null,null,null,null,null,null,{"$f":"IF(ISBLANK(G17),0,1)","v":0},{"$f":"IF(ISBLANK(H17),0,3)","v":0},0]
[null,null,null,"○","Ils sont mobilisés et disposent d’une plateforme pour représenter le programme local de CMMV",null,null,null,null,null,null,0,0,0]
[null,null,"Planification pour la durabilité","Une stratégie nationale de durabilité est en place et adoptée à tous les niveaux :",null,null,null,null,null,{"$f":"IFERROR(O19,\"-\")","v":"-"},null,null,null,null,{"$f":"IFERROR(ROUND(AVERAGEIF(L20:N28,\"<>0\",L20:N28),0),\"-\")","v":"-"}]
[null,null,null,"○","Il existe un plan stratégique clairement articulé et un plan opérationnel chiffré pour assurer la transition vers la durabilité (couvrant les domaines suivants : gestion et coordination du programme, prestation de services de CMMV, qualité du programme, génération de la demande, information stratégique, financement du programme)",null,null,null,null,null,null,0,0,0]
{"$rows_left_out":70}
{"sheet":"Mise en œuvre de programme ","index":6,"n_rows":176,"n_cols":16,"rows_kept":176,"cut":false,"hidden":false,"merged":[[157,2,164,2],[157,3,157,4],[157,9,164,9],[165,2,171,2],[165,3,165,4],[165,9,171,9],[143,2,149,2],[143,3,143,4],[143,9,149,9],[151,2,156,2],[151,3,151,4],[151,9,156,9],[133,2,138,2],[133,3,133,4],[133,9,138,9],[139,2,142,2],[139,3,139,4],[139,9,142,9],[116,2,122,2],[116,3,116,4],[116,9,122,9],[123,2,132,2],[123,3,123,4],[123,9,132,9],[106,2,111,2],[106,3,106,4],[106,9,111,9],[113,2,115,2],[113,3,113,4],[113,9,115,9],[82,2,97,2],[82,3,82,4],[82,9,97,9],[98,2,105,2],[98,3,98,4],[98,9,105,9],[70,2,73,2],[70,3,70,4],[70,9,73,9],[74,2,75,2],[76,2,80,2],[76,3,76,4],[76,9,80,9],[74,9,75,9],[63,2,65,2],[63,3,63,4],[63,9,65,9],[66,2,69,2],[66,3,66,4],[66,9,69,9],[54,2,57,2],[54,3,54,4],[54,9,57,9],[58,2,62,2],[58,3,58,4],[58,9,62,9],[43,2,48,2],[43,3,43,4],[43,9,48,9],[49,2,52,2],[49,3,49,4],[49,9,52,9],[32,2,35,2],[32,3,32,4],[32,9,35,9],[36,3,36,4],[37,2,42,2],[37,3,37,4],[37,9,42,9],[24,2,26,2],[24,3,24,4],[24,9,26,9],[27,2,31,2],[27,3,27,4],[27,9,31,9],[12,2,14,2],[12,3,12,4],[12,9,14,9],[15,2,22,2],[15,3,15,4],[15,9,22,9],[1,2,1,9],[3,3,3,4],[4,2,4,10],[5,2,11,2],[5,3,5,4],[5,9,11,9]]}
[]
[null,null,"Mise en œuvre de programme"]
[]
[null,null,"Élément","Critères",null,"S/O","Absent","Présent mais non optimal","Présent et fonctionnel","Moyenne de l’élément","Commentaires (le cas échéant)","Absent","Present","Optimal","Average","Sustainability Single Figure"]
[null,null,"Ciblage et planification"]
[null,null,"Évaluation démographique (estimation de la taille de la population et cartographie des zones présentant des besoins non satisfaits)","Des estimations de la taille de la population sont disponibles et prennent en compte l’ensemble de la population masculine non circoncise :",null,null,null,null,null,{"$f":"IFERROR(O6,\"-\")","v":"-"},null,null,null,null,{"$f":"IFERROR(ROUND(AVERAGEIF(L7:N12,\"<>0\",L7:N12),0),\"-\")","v":"-"}]
[null,null,null,"○","Des estimations de la taille de la population sont disponibles aux niveaux inranationaux",null,null,null,null,null,null,{"$f":"IF(ISBLANK(G7),0,1)","v":0},{"$f":"IF(ISBLANK(H7),0,3)","v":0},{"$f":"IF(ISBLANK(I7),0,5)","v":0}]
[null,null,null,"○","Les estimations de la taille de la population sont ventilées par cohortes d’âge",null,null,null,null,null,null,0,0,0]
[null,null,null,"○","La taille de la population des zones où les besoins non satisfaits sont estimés ",null,null,null,null,null,null,0,0,0]
[null,null,null,"○","Les estimations de la taille de la population sont à jour (< 5 ans)",null,null,null,null,null,null,{"$f":"IF(ISBLANK(G10),0,1)","v":0},{"$f":"IF(ISBLANK(H10),0,3)","v":0},{"$f":"IF(ISBLANK(I10),0,5)","v":0}]
[null,null,null,"○","Les zones cartographiées de besoins non satisfaits sont utilisées pour établir des priorités",null,null,null,null,null,null,0,0,0]
[null,null,null,"○","Les estimations de la taille de la population et les zones cartographiées des besoins non satisfaits sont utilisées dans la prise de décision et servent de base à la mise en œuvre des programmes",null,null,null,null,null,null,0,0,0]
[null,null,"Évaluation des besoins","Une évaluation des besoins (y compris les besoins en ressources humaines, les besoins en équipement, les besoins en formation, etc.) a été réalisée avec des données précises, opportunes et suffisantes : ",null,null,null,null,null,{"$f":"IFERROR(O13,\"-\")","v":"-"},null,null,null,0,{"$f":"IFERROR(ROUND(AVERAGEIF(L14:N15,\"<>0\",L14:N15),0),\"-\")","v":"-"}]
[null,null,null,"○","Un mécanisme est en place permettant de corriger les trajectoires en fonction des résultats de l’évaluation des besoins",null,null,null,null,null,null,{"$f":"IF(ISBLANK(G14),0,1)","v":0},{"$f":"IF(ISBLANK(H14),0,3)","v":0},{"$f":"IF(ISBLANK(I14),0,5)","v":0}]
[null,null,null,"○","Des réévaluations sont systématiquement pratiquées pour évaluer les améliorations du programme",null,null,null,null,null,null,0,0,0]
[null,null,"Définition de cibles","Des cibles précises et actualisées sont fixées et ventilées à tous les niveaux, du niveau national à celui de l’établissement :",null,null,null,null,null,{"$f":"IFERROR(O16,\"-\")","v":"-"},null,null,0,0,{"$f":"IFERROR(ROUND(AVERAGEIF(L17:N23,\"<>0\",L17:N23),0),\"-\")","v":"-"}]
[null,null,null,"○","Des cibles sont fixées en fonction de l’impact épidémiologique et de la disponibilité des fonds",null,null,null,null,null,null,0,0,0]
[null,null,null,"○","Des cibles sont adoptées par toutes les parties prenantes et celles-ci sont tenues responsables de la réalisation de leurs cibles",null,null,null,null,null,null,0,0,0]
[null,null,null,"○","Des cibles sont utilisées pour informer l’allocation des ressources et la planification des programmes",null,null,null,null,null,null,0,0,0]
[null,null,null,"○","Des cibles sont fixées sur la base de la population totale d’hommes non circoncis, ventilée par cohortes d’âge",null,null,null,null,null,null,0,0,0]
{"$rows_left_out":157}
{"sheet":"Résultats de programme ","index":7,"n_rows":18,"n_cols":15,"rows_kept":18,"cut":false,"hidden":false,"merged":[[9,2,9,4],[10,2,10,4],[11,2,11,4],[8,2,8,4],[1,2,1,9],[3,3,3,4],[5,2,5,4],[6,2,6,4],[7,2,7,4]]}
[]
[null,null,"Résultats de programme"]
[]
[null,null,"Élément","Critères",null,"S/O","Pas d’objectif","Objectif non atteint ou non conforme aux prévisions","Objectif atteint ou en passe de l’être","Moyenne de l’élément","Commentaires (le cas échéant)","Absent","Present","Optimal","Average"]
[null,null,"Impact",null,null,null,null,null,null,null,null,"Absent","Present","Optimal","Average"]
[null,null,"La prévalence nationale de la CM chez les hommes âgés de 15 à 29 ans se situe entre 80 et 100 % ",null,null,null,null,null,null,{"$f":"IFERROR(O6,\"-\")","v":"-"},null,{"$f":"IF(ISBLANK(G6),0,1)","v":0},{"$f":"IF(ISBLANK(H6),0,3)","v":0},{"$f":"IF(ISBLANK(I6),0,5)","v":0},{"$f":"IFERROR(IF(ISBLANK(G6),ROUND(AVERAGEIF(L6:N6,\"<>0\",L6:N6),0),L6),\"-\")","v":"-"}]
[null,null,"La prévalence nationale de la CM chez les hommes âgés de 15 à 49 ans se situe entre 80 et 100 %",null,null,null,null,null,null,"-",null,{"$f":"IF(ISBLANK(G7),0,1)","v":0},{"$f":"IF(ISBLANK(H7),0,3)","v":0},{"$f":"IF(ISBLANK(I7),0,5)","v":0},{"$f":"IFERROR(IF(ISBLANK(G7),ROUND(AVERAGEIF(L7:N7,\"<>0\",L7:N7),0),L7),\"-\")","v":"-"}]
[null,null,"Pourcentage de la cible annuelle de CMMV atteint ",null,null,null,null,null,null,"-",null,0,0,0,"-"]
[null,null,"Pourcentage d’EI sévères et modérés signalés (2 à 4 % ou selon les directives du pays)",null,null,null,null,null,null,"-",null,0,0,0,"-"]
[null,null,"Taux de suivi dans les 14 jours suivant la circoncision à un pourcentage acceptable (80 à 100 %) ",null,null,null,null,null,null,"-",null,0,0,0,"-"]
[null,null,"Pourcentage de clients testés séropositifs liés aux soins et au traitement (80 à  100 %) ",null,null,null,null,null,null,"-",null,0,0,0,"-"]
[null,null,"Variation en pourcentage du nombre de CMMV réalisées au cours des deux dernières années",null,null,null,null,null,null,"-",null,0,0,0,"-"]
[]
[]
[]
[null,null,null,null,null,null,null,null,null,null,null,null,{"$f":"COUNTIF(O6:O13,\"-\")","v":7}]
[null,null,null,null,null,null,null,null,null,null,null,null,{"$f":"COUNTIF(O6:O13,\">0\")","v":0}]
[null,null,null,null,null,null,null,null,null,null,null,"Sheet Completion",{"$f":"M17/(M16+M17)","v":0},{"$f":"1-M18","v":1}]

{"sheet":"Résumé des notes","index":8,"n_rows":56,"n_cols":10,"rows_kept":56,"cut":false,"hidden":false,"merged":[[42,3,48,3],[13,2,41,2],[13,3,15,3],[16,3,22,3],[23,3,29,3],[30,3,32,3],[33,3,38,3],[39,3,41,3],[42,2,50,2],[1,2,1,5],[2,2,12,2],[2,3,5,3],[6,3,9,3],[10,3,11,3]]}
[]
[null,null,"Résumé des notes"]
[null,null,"Gestion de \nprogramme","Leadership et défense des intérêts","Stratégie nationale de CMMV",{"$f":"'Gestion de programme '!O6","v":"-"}]
[null,null,null,null,"Champions",{"$f":"'Gestion de programme '!O13","v":"-"}]
[null,null,null,null,"Planification pour la durabilité",{"$f":"'Gestion de programme '!O19","v":"-"}]
[null,null,null,null,"Stratégie de plaidoyer et boîte à outils",{"$f":"'Gestion de programme '!O29","v":"-"}]
[null,null,null,"Coordination et obligation de rendre compte","Plan opérationnel national de CMMV",{"$f":"'Gestion de programme '!O36","v":"-"}]
[null,null,null,null,"Groupe de travail technique (GTT) pour la CMMV",{"$f":"'Gestion de programme '!O43","v":"-"}]
[null,null,null,null,"Coordination des parties prenantes (dont le secteur traditionnel et la société civile)",{"$f":"'Gestion de programme '!O51","v":"-"}]
[null,null,null,null,"Coordination avec d’autres ministères",{"$f":"'Gestion de programme '!O56","v":"-"}]
[null,null,null,"Politiques et environnement législatif","Directives nationales de mise en œuvre de la CMMV",{"$f":"'Gestion de programme '!O64","v":"-"}]
[null,null,null,null,"Environnement politique favorable à la CMMV",{"$f":"'Gestion de programme '!O72","v":"-"}]
[null,null,null,"Financement","Mobilisation des ressources",{"$f":"'Gestion de programme '!O78","v":"-"}]
[null,null,"Mise en œuvre de programme","Ciblage et planification","Évaluation démographique (estimation de la taille de la population et cartographie des zones présentant des besoins non satisfaits)",{"$f":"'Mise en œuvre de programme '!O6","v":"-"}]
[null,null,null,null,"Évaluation des besoins",{"$f":"'Mise en œuvre de programme '!O13","v":"-"}]
[null,null,null,null,"Définition de cibles",{"$f":"'Mise en œuvre de programme '!O16","v":"-"}]
[null,null,null,"Facteurs de prestation de services","Disponibilité des services (horaires d’ouverture)",{"$f":"'Mise en œuvre de programme '!O25","v":"-"}]
[null,null,null,null,"Accessibilité des services (transport)",{"$f":"'Mise en œuvre de programme '!O28","v":"-"}]
[null,null,null,null,"Services intégrés et systématisés",{"$f":"'Mise en œuvre de programme '!O33","v":"-"}]
[null,null,null,null,"Services équitables",{"$f":"'Mise en œuvre de programme '!O37","v":"-"}]
{"$rows_left_out":37}
{"sheet":"Étapes suivantes","index":9,"n_rows":54,"n_cols":8,"rows_kept":54,"cut":false,"hidden":false,"merged":[[1,2,1,8],[11,2,11,3]]}
[]
[null,null,"Étapes suivantes"]
[]
[null,null,null,null,null,"Élément à traiter/améliorer","Raison de la mauvaise performance","Actions proposées (ex. : soutien requis ou actions correctives). "]
[null,null,null,null,1,{"$f":"IFERROR(INDEX('Résumé des notes'!$E$1:$E$93,SMALL(IF('Résumé des notes'!$F$1:$F$93<=$C$12,ROW('Résumé des notes'!$F$1:$F$93)),ROW(3:3))),\"\")","v":0}]
[null,null,null,null,2,{"$f":"IFERROR(INDEX('Résumé des notes'!$E$1:$E$93,SMALL(IF('Résumé des notes'!$F$1:$F$93<=$C$12,ROW('Résumé des notes'!$F$1:$F$93)),ROW(4:4))),\"\")","v":0}]
[null,null,null,null,3,{"$f":"IFERROR(INDEX('Résumé des notes'!$E$1:$E$93,SMALL(IF('Résumé des notes'!$F$1:$F$93<=$C$12,ROW('Résumé des notes'!$F$1:$F$93)),ROW(5:5))),\"\")","v":0}]
[null,null,null,null,4,{"$f":"IFERROR(INDEX('Résumé des notes'!$E$1:$E$93,SMALL(IF('Résumé des notes'!$F$1:$F$93<=$C$12,ROW('Résumé des notes'!$F$1:$F$93)),ROW(6:6))),\"\")","v":0}]
[null,null,null,null,5,{"$f":"IFERROR(INDEX('Résumé des notes'!$E$1:$E$93,SMALL(IF('Résumé des notes'!$F$1:$F$93<=$C$12,ROW('Résumé des notes'!$F$1:$F$93)),ROW(7:7))),\"\")","v":0}]
[null,null,null,null,6,{"$f":"IFERROR(INDEX('Résumé des notes'!$E$1:$E$93,SMALL(IF('Résumé des notes'!$F$1:$F$93<=$C$12,ROW('Résumé des notes'!$F$1:$F$93)),ROW(8:8))),\"\")","v":0}]
[null,null,null,null,7,{"$f":"IFERROR(INDEX('Résumé des notes'!$E$1:$E$93,SMALL(IF('Résumé des notes'!$F$1:$F$93<=$C$12,ROW('Résumé des notes'!$F$1:$F$93)),ROW(9:9))),\"\")","v":0}]
[null,null,null,null,8,{"$f":"IFERROR(INDEX('Résumé des notes'!$E$1:$E$93,SMALL(IF('Résumé des notes'!$F$1:$F$93<=$C$12,ROW('Résumé des notes'!$F$1:$F$93)),ROW(10:10))),\"\")","v":0}]
[null,null,null,null,9,{"$f":"IFERROR(INDEX('Résumé des notes'!$E$1:$E$93,SMALL(IF('Résumé des notes'!$F$1:$F$93<=$C$12,ROW('Résumé des notes'!$F$1:$F$93)),ROW(11:11))),\"\")","v":0}]
[null,null,null,null,10,{"$f":"IFERROR(INDEX('Résumé des notes'!$E$1:$E$93,SMALL(IF('Résumé des notes'!$F$1:$F$93<=$C$12,ROW('Résumé des notes'!$F$1:$F$93)),ROW(12:12))),\"\")","v":0}]
[null,null,null,null,11,{"$f":"IFERROR(INDEX('Résumé des notes'!$E$1:$E$93,SMALL(IF('Résumé des notes'!$F$1:$F$93<=$C$12,ROW('Résumé des notes'!$F$1:$F$93)),ROW(13:13))),\"\")","v":0}]
[null,null,null,null,12,{"$f":"IFERROR(INDEX('Résumé des notes'!$E$1:$E$93,SMALL(IF('Résumé des notes'!$F$1:$F$93<=$C$12,ROW('Résumé des notes'!$F$1:$F$93)),ROW(14:14))),\"\")","v":0}]
[null,null,null,null,13,{"$f":"IFERROR(INDEX('Résumé des notes'!$E$1:$E$93,SMALL(IF('Résumé des notes'!$F$1:$F$93<=$C$12,ROW('Résumé des notes'!$F$1:$F$93)),ROW(15:15))),\"\")","v":0}]
[null,null,null,null,14,{"$f":"IFERROR(INDEX('Résumé des notes'!$E$1:$E$93,SMALL(IF('Résumé des notes'!$F$1:$F$93<=$C$12,ROW('Résumé des notes'!$F$1:$F$93)),ROW(16:16))),\"\")","v":0}]
[null,null,null,null,15,{"$f":"IFERROR(INDEX('Résumé des notes'!$E$1:$E$93,SMALL(IF('Résumé des notes'!$F$1:$F$93<=$C$12,ROW('Résumé des notes'!$F$1:$F$93)),ROW(17:17))),\"\")","v":0}]
[null,null,null,null,16,{"$f":"IFERROR(INDEX('Résumé des notes'!$E$1:$E$93,SMALL(IF('Résumé des notes'!$F$1:$F$93<=$C$12,ROW('Résumé des notes'!$F$1:$F$93)),ROW(18:18))),\"\")","v":0}]
{"$rows_left_out":35}
{"sheet":"Bibliographie","index":10,"n_rows":17,"n_cols":3,"rows_kept":17,"cut":false,"hidden":false,"merged":[[1,1,1,2]]}
[]
[null,"Bibliographie"]
[null,1,"A Framework for VMMC 2021 Policy Brief, WHO and UNAIDS, 2016"]
[null,2,"Joint Strategic Action Framework to Accelerate the Scale-up of VMMC for HIV Prevention in ESA 2012-2016, WHO and UNAIDS, 2012"]
[null,3,"Joint United Nations Programme on HIV/AIDS. (2020). Maintaining and prioritizing HIV prevention services in the time of COVID-19."]
[null,4,"Joint United Nations Programme on HIV/AIDS. (2020). Condoms and lubricants in the time of COVID-19. Sustaining supplies and people-centred approaches to meet the need in low- and middle-income countries."]
[null,5,"Joint United Nations Programme on HIV/AIDS. (2020). UNAIDS highlights six critical actions to put gender equality at the centre of COVID-19 responses. "]
[null,6,"Joint United Nations Programme on HIV/AIDS. (2020). Strategic Considerations for Mitigating the Impact of COVID-19 on Key-Population-Focused HIV Programs."]
[null,7,"Joint United Nations Programme on HIV/AIDS. (2020). Preventing HIV and other STIs among women and girls using contraceptive services in contexts with high HIV incidence. "]
[null,8,"Joint United Nations Programme on HIV/AIDS. (2021). Going Online: A Budgeting and Programming Aid for Virtual HIV Interventions. "]
[null,3,"Manual for MMC, Chapter 2: An opportunity for expanded services for adolescent boys and men. 2018. WHO"]
[null,4,"MMC Manual, Chapter 3: Facilities, Supplies and Infrastructure for MMC Programs. WHO, 2018"]
[null,5,"MMC Manual, Chapter 4: Recordkeeping, reporting and quality assurance. WHO, 2018"]
[null,6,"Policy Guidelines for Sustaining Medical Male Circumcision Services in Kenya. National AIDS & STI Control Program, Ministry of Health, 2018"]
[null,7,"South African National Guidelines for MMC, 2016, Department of Health for the Republic of South Africa "]
[null,8,"Sustainability Transition Implementation Plan 2019 - 2021 for VMMC. Zimbabwe Ministry pf Health & Child Care"]
[null,9,"UNAIDS (2018) VMMC Scorecard"]

{"sheet":"Acronymes","index":11,"n_rows":19,"n_cols":4,"rows_kept":19,"cut":false,"hidden":false,"merged":[[1,2,1,3]]}
[]
[null,null,"Acronymes"]
[null,null,"AJF","Adolescentes et jeunes femmes"]
[null,null,"AQ","Assurance qualité"]
[null,null,"CCCS","Communication sur le changement de comportement social"]
[null,null,"CM / CMM / CMMV","Circoncision médicale / Circoncision masculine médicale / Circoncision masculine médicale volontaire"]
[null,null,"EI","Événement indésirable"]
[null,null,"GTT","Groupe de travail technique"]
[null,null,"IEC","Information, éducation et communication"]
[null,null,"IST","Infection sexuellement transmissible"]
[null,null,"OAEP","Outil d’auto-évaluation de la prévention du VIH "]
[null,null,"OMS","Organisation mondiale de la Santé"]
[null,null,"ONUSIDA","Programme des Nations unies sur le VIH/sida"]
[null,null,"PaE","Prophylaxie avant exposition"]
[null,null,"PC","Populations clés"]
[null,null,"POP","Procédure opérationnelle permanente"]
[null,null,"S&E","Suivi et évaluation"]
[null,null,"SDV","Services de dépistage du VIH"]
[null,null,"VIH+ ","Séropositif"]