{"text_format":"1","workbook":"xlsx","n_sheets":12,"sheets":["Outline","Introduction","Instructions","FAQs","Guidance for VMMC","Programme Management ","Programme Implementation ","Programme Outcomes ","Summary of scores","Next steps","Bibliography","Acronyms"],"not_rendered":{"charts":6,"images":0,"macros":1,"external_links":0,"defined_names":19,"comments":0,"pivot_tables":0},"unopened":[],"bounds":{"document_bytes":16777216,"sheet_cells":100000,"rows_first":2000,"rows_last":500,"rows_between":2000,"halvings":0,"cell_chars":16384,"cell_head_chars":4096},"cells_cut":0,"cells_raw":0,"read":"whole","date_system":"1900"}

{"sheet":"Outline","index":0,"n_rows":46,"n_cols":6,"rows_kept":46,"cut":false,"hidden":true,"merged":[[0,3,1,5],[3,1,5,1],[6,1,9,1],[10,1,11,1],[3,0,12,0],[38,0,45,0],[38,1,41,1],[42,1,45,1],[13,0,37,0],[16,1,20,1],[21,1,26,1],[27,1,29,1],[35,1,37,1],[30,1,34,1],[13,1,15,1]]}
[]
[]
["DOMAIN","FUNCTION",{"$f":"#REF!","v":{"$error":"#REF!"}},{"$f":"#REF!","v":{"$error":"#REF!"}},"REFERENCE","REVIEWER'S COMMENTS"]
["Program Management","1. Leadership & advocacy","1.1","National MMC Strategy","A Framework for VMMC 2021 Policy Brief, WHO and UNAIDS, 2016\nJoint Strategic Action Framework to Accelerate the Scale-up of VMMC for HIV Prevention in ESA 2012-2016, WHO and UNAIDS, 2007"]
[null,null,"1.2","Champions","A Framework for VMMC 2021 Policy Brief, WHO and UNAIDS, 2016\nJoint Strategic Action Framework to Accelerate the Scale-up of VMMC for HIV Prevention in ESA 2012-2016, WHO and UNAIDS, 2008"]
[null,null,"1.3","Advocacy strategy and toolkit","A Framework for VMMC 2021 Policy Brief, WHO and UNAIDS, 2016\nJoint Strategic Action Framework to Accelerate the Scale-up of VMMC for HIV Prevention in ESA 2012-2016, WHO and UNAIDS, 2009"]
[null,"2. Coordination & accountability","2.1","National MMC Operational Plan","A Framework for VMMC 2021 Policy Brief, WHO and UNAIDS, 2016\nJoint Strategic Action Framework to Accelerate the Scale-up of VMMC for HIV Prevention in ESA 2012-2016, WHO and UNAIDS, 2010"]
[null,null,"2.2","Technical Working Group (TWG) for MMC","A Framework for VMMC 2021 Policy Brief, WHO and UNAIDS, 2016\nJoint Strategic Action Framework to Accelerate the Scale-up of VMMC for HIV Prevention in ESA 2012-2016, WHO and UNAIDS, 2011"]
[null,null,"2.3","Stakeholder coordination (including traditional sector and civil society)","A Framework for VMMC 2021 Policy Brief, WHO and UNAIDS, 2016\nJoint Strategic Action Framework to Accelerate the Scale-up of VMMC for HIV Prevention in ESA 2012-2016, WHO and UNAIDS, 2012"]
[null,null,"2.4","Coordination with other Ministries","Sustainability Transition Implementation Plan 2019 - 2021 for VMMC. Zimbabwe Ministry pf Health & Child Care"]
[null,"3. Policies & legislative environment","3.1","National MMC Implementation guidelines","South African National Guidelines for MMC, 2016, Department of Health for the Republic of South Africa\nhttps://www.who.int/hiv/pub/malecircumcision/male-circumcision-guide-2018/en/"]
[null,null,"3.2","Policy enabling environment for MMC","Manual for MMC, Chapter 2: An opportunity for expanded services for adolescent boys and men. 2018. WHO"]
[null,"4. Financing","4.1","Resource mobilization","Joint Strategic Action Framework to Accelerate the Scale-up of VMMC for HIV Prevention in ESA 2012-2016, WHO and UNAIDS, 2012\nManual for MMC, Chapter 2: An opportunity for expanded services for adolescent boys and men. 2018. WHO\nPolicy Guidelines for Sustaining Medical Male Circumcision Services in Kenya, Kenya Ministry of Health, 2018"]
["Program Implementation","5. Targeting and planning","5.1","Demographic assessment (population size estimation and mapping areas of unmet need)"]
[null,null,"5.2","Needs assessment"]
[null,null,"5.3","Target setting"]
[null,"6. Service delivery factors","6.1","Availability of services (operating hours)","Manual for MMC, Chapter 2: An opportunity for expanded services for adolescent boys and men. 2018. WHO"]
[null,null,"6.2","Accessibility of services (transportation)"]
[null,null,"6.3","Trained and capacitated healthcare workers "]
[null,null,"6.4","Facilities, supplies and infrastructure","MMC Manual, Chapter 3: Facilities, Supplies and Infrastructure for MMC Programs. WHO, 2018"]
{"$rows_left_out":27}
{"sheet":"Introduction","index":1,"n_rows":2,"n_cols":3,"rows_kept":2,"cut":false,"hidden":false,"merged":[[1,2,1,22]]}
[]
[null,null,"What are the HIV Prevention Self-Assessment Tools (PSAT)?"]

{"sheet":"Instructions","index":2,"n_rows":3,"n_cols":3,"rows_kept":3,"cut":false,"hidden":false,"merged":[[2,2,2,17]]}
[]
[]
[null,null,"How to complete the PSAT"]

{"sheet":"FAQs","index":3,"n_rows":2,"n_cols":2,"rows_kept":2,"cut":false,"hidden":false,"merged":[[1,1,1,21]]}
[]
[null,"Frequently Asked Questions"]

{"sheet":"Guidance for VMMC","index":4,"n_rows":2,"n_cols":2,"rows_kept":2,"cut":false,"hidden":false,"merged":[[1,1,1,21]]}
[]
[null,"Voluntary medical male circumcision programme"]

{"sheet":"Programme Management ","index":5,"n_rows":89,"n_cols":16,"rows_kept":89,"cut":false,"hidden":false,"merged":[[1,2,1,9],[3,3,3,4],[4,2,4,10],[5,2,11,2],[5,3,5,4],[5,9,11,9],[42,2,49,2],[42,3,42,4],[42,9,49,9],[12,2,17,2],[12,3,12,4],[12,9,17,9],[18,2,27,2],[18,3,18,4],[18,9,27,9],[28,2,33,2],[28,3,28,4],[28,9,33,9],[35,2,41,2],[35,3,35,4],[35,9,41,9],[77,9,83,9],[50,2,54,2],[51,9,54,9],[55,2,61,2],[55,3,55,4],[55,9,61,9],[63,2,70,2],[63,9,70,9],[50,3,50,4],[71,3,71,4],[71,2,75,2],[71,9,75,9],[77,2,83,2],[77,3,77,4],[63,3,63,4]]}
[]
[null,null,"Programme Management"]
[]
[null,null,"Element","Criteria",null,"N/A","Absent","Present but not optimal","Present and working well","Average for element","Comments (if applicable)","Absent","Present","Optimal","Average","Sustainability Single Figure"]
[null,null,"Leadership and Advocacy"]
[null,null,"National VMMC Strategy","There are national strategic goals and guidelines in place:",null,null,null,null,null,{"$f":"IFERROR(O6,\"-\")","v":"-"},null,null,null,null,{"$f":"IFERROR(ROUND(AVERAGEIF(L7:N12,\"<>0\",L7:N12),0),\"-\")","v":"-"}]
[null,null,null,"○","The strategic goals and guidelines are current (updated every 3-5 years)",null,null,null,null,null,null,{"$f":"IF(ISBLANK(G7),0,1)","v":0},{"$f":"IF(ISBLANK(H7),0,3)","v":0},{"$f":"IF(ISBLANK(I7),0,5)","v":0}]
[null,null,null,"○","The strategic goals are aligned to global, national and sub-national standards",null,null,null,null,null,null,0,0,0]
[null,null,null,"○","There is commitment to implement the national strategies from all stakeholders ",null,null,null,null,null,null,0,0,0]
[null,null,null,"○","The strategy provides clear goals and objectives for scale-up, with a future-mindedness for sustainability",null,null,null,null,null,null,0,0,0]
[null,null,null,"○","There is strong programmatic response to the strategic goal and objectives",null,null,null,null,null,null,0,0,0]
[null,null,null,"○","The theory of change identifies each stakeholders' contribution and outlines success factors, activities & stakeholders",null,null,null,null,null,null,0,0,0]
[null,null,"Champions","Champions at national and sub-national levels  are identified, equipped and supported to advocate for VMMC: ",null,null,null,null,null,{"$f":"IFERROR(O13,\"-\")","v":"-"},null,null,null,null,{"$f":"IFERROR(ROUND(AVERAGEIF(L14:N18,\"<>0\",L14:N18),0),\"-\")","v":"-"}]
[null,null,null,"○","They represent various sectors (health, education, grassroots, traditional or religious groups) ",null,null,null,null,null,null,{"$f":"IF(ISBLANK(G14),0,1)","v":0},{"$f":"IF(ISBLANK(H14),0,3)","v":0},{"$f":"IF(ISBLANK(I14),0,5)","v":0}]
[null,null,null,"○","They are provided with information to effectively advocate for VMMC",null,null,null,null,null,null,0,0,0]
[null,null,null,"○","They attend champions meetings to discuss best practices and provide progress updates",null,null,null,null,null,null,0,0,0]
[null,null,null,"○","They receive sensitisation training and support from the local VMMC programme",null,null,null,null,null,null,0,0,0]
[null,null,null,"○","They are mobilised and given a platform to represent the local VMMC programme",null,null,null,null,null,null,0,0,0]
[null,null,"Planning for sustainability","A national sustainability strategy is in place and adopted at all levels:",null,null,null,null,null,{"$f":"IFERROR(O19,\"-\")","v":"-"},null,null,null,null,{"$f":"IFERROR(ROUND(AVERAGEIF(L20:N28,\"<>0\",L20:N28),0),\"-\")","v":"-"}]
[null,null,null,"○","There is a  clearly articulated strategic plan and costed operational plan to transition toward sustainability (consisting of the following areas: programme management and coordination; VMMC service delivery; programme quality; demand generation; strategic information; programme financing)",null,null,null,null,null,null,0,0,0]
{"$rows_left_out":70}
{"sheet":"Programme Implementation ","index":6,"n_rows":175,"n_cols":16,"rows_kept":175,"cut":false,"hidden":false,"merged":[[1,2,1,9],[3,3,3,4],[4,2,4,10],[5,2,11,2],[5,3,5,4],[5,9,11,9],[12,2,14,2],[12,3,12,4],[12,9,14,9],[15,2,22,2],[15,3,15,4],[15,9,22,9],[24,2,26,2],[24,3,24,4],[24,9,26,9],[27,2,31,2],[27,3,27,4],[27,9,31,9],[32,2,35,2],[32,3,32,4],[32,9,35,9],[36,3,36,4],[37,2,42,2],[37,3,37,4],[37,9,42,9],[43,2,47,2],[43,3,43,4],[43,9,47,9],[48,2,51,2],[48,3,48,4],[48,9,51,9],[53,2,56,2],[53,3,53,4],[53,9,56,9],[57,2,61,2],[57,3,57,4],[57,9,61,9],[62,2,64,2],[62,3,62,4],[62,9,64,9],[65,2,68,2],[65,3,65,4],[65,9,68,9],[69,2,72,2],[69,3,69,4],[69,9,72,9],[73,2,74,2],[75,2,79,2],[75,3,75,4],[75,9,79,9],[73,9,74,9],[81,2,96,2],[81,3,81,4],[81,9,96,9],[97,2,104,2],[97,3,97,4],[97,9,104,9],[105,2,110,2],[105,3,105,4],[105,9,110,9],[112,2,114,2],[112,3,112,4],[112,9,114,9],[115,2,121,2],[115,3,115,4],[115,9,121,9],[122,2,131,2],[122,3,122,4],[122,9,131,9],[132,2,137,2],[132,3,132,4],[132,9,137,9],[138,2,141,2],[138,3,138,4],[138,9,141,9],[142,2,148,2],[142,3,142,4],[142,9,148,9],[150,2,155,2],[150,3,150,4],[150,9,155,9],[156,2,163,2],[156,3,156,4],[156,9,163,9],[164,2,170,2],[164,3,164,4],[164,9,170,9]]}
[]
[null,null,"Programme Implementation"]
[]
[null,null,"Element","Criteria",null,"N/A","Absent","Present but not optimal","Present and working well","Average for element","Comments (if applicable)","Absent","Present","Optimal","Average","Sustainability Single Figure"]
[null,null,"Targeting & planning"]
[null,null,"Demographic assessment (population size estimation and mapping areas of unmet need)","Population size estimates are available and consider the entire uncircumcised male population:",null,null,null,null,null,{"$f":"IFERROR(O6,\"-\")","v":"-"},null,null,null,null,{"$f":"IFERROR(ROUND(AVERAGEIF(L7:N12,\"<>0\",L7:N12),0),\"-\")","v":"-"}]
[null,null,null,"○","Population size estimates are available at sub-national levels",null,null,null,null,null,null,{"$f":"IF(ISBLANK(G7),0,1)","v":0},{"$f":"IF(ISBLANK(H7),0,3)","v":0},{"$f":"IF(ISBLANK(I7),0,5)","v":0}]
[null,null,null,"○","Population size estimates are disaggregated by age cohorts",null,null,null,null,null,null,0,0,0]
[null,null,null,"○","Population size estimates are mapped areas of unmet need ",null,null,null,null,null,null,0,0,0]
[null,null,null,"○","Population size estimates are up to date (< 5 years)",null,null,null,null,null,null,{"$f":"IF(ISBLANK(G10),0,1)","v":0},{"$f":"IF(ISBLANK(H10),0,3)","v":0},{"$f":"IF(ISBLANK(I10),0,5)","v":0}]
[null,null,null,"○","Mapped areas of unmet need are used for prioritisation",null,null,null,null,null,null,0,0,0]
[null,null,null,"○","Population size estimates and mapped areas of unmet need are used in decision making and inform programme implementation",null,null,null,null,null,null,0,0,0]
[null,null,"Needs assessment","A needs assessment (including HR needs, equipment needs, training needs etc.) has been completed with accurate, timely and sufficient data: ",null,null,null,null,null,{"$f":"IFERROR(O13,\"-\")","v":"-"},null,null,null,null,{"$f":"IFERROR(ROUND(AVERAGEIF(L14:N15,\"<>0\",L14:N15),0),\"-\")","v":"-"}]
[null,null,null,"○","There is a mechanism in place to course correct based on the needs assessment findings",null,null,null,null,null,null,{"$f":"IF(ISBLANK(G14),0,1)","v":0},{"$f":"IF(ISBLANK(H14),0,3)","v":0},{"$f":"IF(ISBLANK(I14),0,5)","v":0}]
[null,null,null,"○","There are routine re-assessments to evaluate programmatic improvements",null,null,null,null,null,null,0,0,0]
[null,null,"Target setting","Accurate and updated targets are set and disaggregated at all levels from national down to the facility:",null,null,null,null,null,{"$f":"IFERROR(O16,\"-\")","v":"-"},null,null,null,null,{"$f":"IFERROR(ROUND(AVERAGEIF(L17:N23,\"<>0\",L17:N23),0),\"-\")","v":"-"}]
[null,null,null,"○","Targets are set based on epidemiological impact and availability of funds",null,null,null,null,null,null,0,0,0]
[null,null,null,"○","Targets are adopted by all stakeholders and stakeholders are held accountable for reaching their targets",null,null,null,null,null,null,0,0,0]
[null,null,null,"○","Targets are used to inform resource allocations and programme planning",null,null,null,null,null,null,0,0,0]
[null,null,null,"○","Targets are set based on total population of uncircumcised men disaggregated by age cohorts",null,null,null,null,null,null,0,0,0]
{"$rows_left_out":156}
{"sheet":"Programme Outcomes ","index":7,"n_rows":18,"n_cols":15,"rows_kept":18,"cut":false,"hidden":false,"merged":[[9,2,9,4],[10,2,10,4],[11,2,11,4],[8,2,8,4],[1,2,1,9],[3,3,3,4],[5,2,5,4],[6,2,6,4],[7,2,7,4]]}
[]
[null,null,"Programme Outcomes"]
[]
[null,null,"Element","Criteria",null,"N/A","No target","Target not met or not on track","Target met or on track","Average for element","Comments (if applicable)","Absent","Present","Optimal","Average"]
[null,null,"Impact",null,null,null,null,null,null,null,null,"Absent","Present","Optimal","Average"]
[null,null,"National MC prevalence among males aged 15-29 is between 80-100% ",null,null,null,null,null,null,{"$f":"IFERROR(O6,\"-\")","v":"-"},null,{"$f":"IF(ISBLANK(G6),0,1)","v":0},{"$f":"IF(ISBLANK(H6),0,3)","v":0},{"$f":"IF(ISBLANK(I6),0,5)","v":0},{"$f":"IFERROR(IF(ISBLANK(G6),ROUND(AVERAGEIF(L6:N6,\"<>0\",L6:N6),0),L6),\"-\")","v":"-"}]
[null,null,"National MC prevalence among males aged 15-49 is between 80-100%",null,null,null,null,null,null,"-",null,{"$f":"IF(ISBLANK(G7),0,1)","v":0},{"$f":"IF(ISBLANK(H7),0,3)","v":0},{"$f":"IF(ISBLANK(I7),0,5)","v":0},{"$f":"IFERROR(IF(ISBLANK(G7),ROUND(AVERAGEIF(L7:N7,\"<>0\",L7:N7),0),L7),\"-\")","v":"-"}]
[null,null,"Percentage of annual VMMC target achieved ",null,null,null,null,null,null,"-",null,0,0,0,"-"]
[null,null,"Percentage of severe and moderate AE's reported (2% -  4% or according to country guidelines)",null,null,null,null,null,null,"-",null,0,0,0,"-"]
[null,null,"Follow up rates within 14 days post circumcision at an acceptable percentage (80% - 100%) ",null,null,null,null,null,null,"-",null,0,0,0,"-"]
[null,null,"Percentage of clients that test HIV positive linked to care and treatment (80% - 100%) ",null,null,null,null,null,null,"-",null,0,0,0,"-"]
[null,null,"Percentage change in the number of VMMCs performed over the two most recent years",null,null,null,null,null,null,"-",null,0,0,0,"-"]
[]
[]
[]
[null,null,null,null,null,null,null,null,null,null,null,null,{"$f":"COUNTIF(O6:O13,\"-\")","v":7}]
[null,null,null,null,null,null,null,null,null,null,null,null,{"$f":"COUNTIF(O6:O13,\">0\")","v":0}]
[null,null,null,null,null,null,null,null,null,null,null,"Sheet Completion",{"$f":"M17/(M16+M17)","v":0},{"$f":"1-M18","v":1}]

{"sheet":"Summary of scores","index":8,"n_rows":56,"n_cols":10,"rows_kept":56,"cut":false,"hidden":false,"merged":[[1,2,1,5],[2,2,12,2],[2,3,5,3],[6,3,9,3],[10,3,11,3],[42,3,48,3],[13,2,41,2],[13,3,15,3],[16,3,22,3],[23,3,29,3],[30,3,32,3],[33,3,38,3],[39,3,41,3],[42,2,50,2]]}
[]
[null,null,"Summary of scores"]
[null,null,"Programme \nManagement","Leadership and advocacy","National VMMC Strategy",{"$f":"'Programme Management '!O6","v":"-"}]
[null,null,null,null,"Champions",{"$f":"'Programme Management '!O13","v":"-"}]
[null,null,null,null,"Planning for sustainability",{"$f":"'Programme Management '!O19","v":"-"}]
[null,null,null,null,"Advocacy Strategy and Toolkit",{"$f":"'Programme Management '!O29","v":"-"}]
[null,null,null,"Coordination and accountability","National VMMC Operational Plan",{"$f":"'Programme Management '!O36","v":"-"}]
[null,null,null,null,"Technical Working Group (TWG) for VMMC",{"$f":"'Programme Management '!O43","v":"-"}]
[null,null,null,null,"Stakeholder coordination (including traditional sector and civil society)",{"$f":"'Programme Management '!O51","v":"-"}]
[null,null,null,null,"Coordination with other Ministries",{"$f":"'Programme Management '!O56","v":"-"}]
[null,null,null,"Policies and legislative environment","National VMMC Implementation Guidelines",{"$f":"'Programme Management '!O64","v":"-"}]
[null,null,null,null,"Policy enabling environment for VMMC",{"$f":"'Programme Management '!O72","v":"-"}]
[null,null,null,"Financing","Resource mobilisation",{"$f":"'Programme Management '!O78","v":"-"}]
[null,null,"Programme Implementation","Targeting and planning","Demographic assessment (population size estimation and mapping areas of unmet need)",{"$f":"'Programme Implementation '!O6","v":"-"}]
[null,null,null,null,"Needs assessment",{"$f":"'Programme Implementation '!O13","v":"-"}]
[null,null,null,null,"Target setting",{"$f":"'Programme Implementation '!O16","v":"-"}]
[null,null,null,"Service delivery factors","Availability of services (operating hours)",{"$f":"'Programme Implementation '!O25","v":"-"}]
[null,null,null,null,"Accessibility of services (transportation)",{"$f":"'Programme Implementation '!O28","v":"-"}]
[null,null,null,null,"Integrated and routinised services",{"$f":"'Programme Implementation '!O33","v":"-"}]
[null,null,null,null,"Equitable services",{"$f":"'Programme Implementation '!O37","v":"-"}]
{"$rows_left_out":37}
{"sheet":"Next steps","index":9,"n_rows":54,"n_cols":8,"rows_kept":54,"cut":false,"hidden":false,"merged":[[1,2,1,8],[11,2,11,3]]}
[]
[null,null,"Next Steps"]
[]
[null,null,null,null,null,"Element that needs to be addressed","Reason for low performance","Proposed actions (e.g. support required or corrective actions). "]
[null,null,null,null,1,{"$f":"IFERROR(INDEX('Summary of scores'!$E$1:$E$93,SMALL(IF('Summary of scores'!$F$1:$F$93<=$C$12,ROW('Summary of scores'!$F$1:$F$93)),ROW(3:3))),\"\")","v":0}]
[null,null,null,null,2,{"$f":"IFERROR(INDEX('Summary of scores'!$E$1:$E$93,SMALL(IF('Summary of scores'!$F$1:$F$93<=$C$12,ROW('Summary of scores'!$F$1:$F$93)),ROW(4:4))),\"\")","v":0}]
[null,null,null,null,3,{"$f":"IFERROR(INDEX('Summary of scores'!$E$1:$E$93,SMALL(IF('Summary of scores'!$F$1:$F$93<=$C$12,ROW('Summary of scores'!$F$1:$F$93)),ROW(5:5))),\"\")","v":0}]
[null,null,null,null,4,{"$f":"IFERROR(INDEX('Summary of scores'!$E$1:$E$93,SMALL(IF('Summary of scores'!$F$1:$F$93<=$C$12,ROW('Summary of scores'!$F$1:$F$93)),ROW(6:6))),\"\")","v":0}]
[null,null,null,null,5,{"$f":"IFERROR(INDEX('Summary of scores'!$E$1:$E$93,SMALL(IF('Summary of scores'!$F$1:$F$93<=$C$12,ROW('Summary of scores'!$F$1:$F$93)),ROW(7:7))),\"\")","v":0}]
[null,null,null,null,6,{"$f":"IFERROR(INDEX('Summary of scores'!$E$1:$E$93,SMALL(IF('Summary of scores'!$F$1:$F$93<=$C$12,ROW('Summary of scores'!$F$1:$F$93)),ROW(8:8))),\"\")","v":0}]
[null,null,null,null,7,{"$f":"IFERROR(INDEX('Summary of scores'!$E$1:$E$93,SMALL(IF('Summary of scores'!$F$1:$F$93<=$C$12,ROW('Summary of scores'!$F$1:$F$93)),ROW(9:9))),\"\")","v":0}]
[null,null,null,null,8,{"$f":"IFERROR(INDEX('Summary of scores'!$E$1:$E$93,SMALL(IF('Summary of scores'!$F$1:$F$93<=$C$12,ROW('Summary of scores'!$F$1:$F$93)),ROW(10:10))),\"\")","v":0}]
[null,null,null,null,9,{"$f":"IFERROR(INDEX('Summary of scores'!$E$1:$E$93,SMALL(IF('Summary of scores'!$F$1:$F$93<=$C$12,ROW('Summary of scores'!$F$1:$F$93)),ROW(11:11))),\"\")","v":0}]
[null,null,null,null,10,{"$f":"IFERROR(INDEX('Summary of scores'!$E$1:$E$93,SMALL(IF('Summary of scores'!$F$1:$F$93<=$C$12,ROW('Summary of scores'!$F$1:$F$93)),ROW(12:12))),\"\")","v":0}]
[null,null,null,null,11,{"$f":"IFERROR(INDEX('Summary of scores'!$E$1:$E$93,SMALL(IF('Summary of scores'!$F$1:$F$93<=$C$12,ROW('Summary of scores'!$F$1:$F$93)),ROW(13:13))),\"\")","v":0}]
[null,null,null,null,12,{"$f":"IFERROR(INDEX('Summary of scores'!$E$1:$E$93,SMALL(IF('Summary of scores'!$F$1:$F$93<=$C$12,ROW('Summary of scores'!$F$1:$F$93)),ROW(14:14))),\"\")","v":0}]
[null,null,null,null,13,{"$f":"IFERROR(INDEX('Summary of scores'!$E$1:$E$93,SMALL(IF('Summary of scores'!$F$1:$F$93<=$C$12,ROW('Summary of scores'!$F$1:$F$93)),ROW(15:15))),\"\")","v":0}]
[null,null,null,null,14,{"$f":"IFERROR(INDEX('Summary of scores'!$E$1:$E$93,SMALL(IF('Summary of scores'!$F$1:$F$93<=$C$12,ROW('Summary of scores'!$F$1:$F$93)),ROW(16:16))),\"\")","v":0}]
[null,null,null,null,15,{"$f":"IFERROR(INDEX('Summary of scores'!$E$1:$E$93,SMALL(IF('Summary of scores'!$F$1:$F$93<=$C$12,ROW('Summary of scores'!$F$1:$F$93)),ROW(17:17))),\"\")","v":0}]
[null,null,null,null,16,{"$f":"IFERROR(INDEX('Summary of scores'!$E$1:$E$93,SMALL(IF('Summary of scores'!$F$1:$F$93<=$C$12,ROW('Summary of scores'!$F$1:$F$93)),ROW(18:18))),\"\")","v":0}]
{"$rows_left_out":35}
{"sheet":"Bibliography","index":10,"n_rows":17,"n_cols":3,"rows_kept":17,"cut":false,"hidden":false,"merged":[[1,1,1,2]]}
[]
[null,"Bibliography"]
[null,1,"A Framework for VMMC 2021 Policy Brief, WHO and UNAIDS, 2016"]
[null,2,"Joint Strategic Action Framework to Accelerate the Scale-up of VMMC for HIV Prevention in ESA 2012-2016, WHO and UNAIDS, 2012"]
[null,3,"Joint United Nations Programme on HIV/AIDS. (2020). Maintaining and prioritizing HIV prevention services in the time of COVID-19."]
[null,4,"Joint United Nations Programme on HIV/AIDS. (2020). Condoms and lubricants in the time of COVID-19. Sustaining supplies and people-centred approaches to meet the need in low- and middle-income countries."]
[null,5,"Joint United Nations Programme on HIV/AIDS. (2020). UNAIDS highlights six critical actions to put gender equality at the centre of COVID-19 responses. "]
[null,6,"Joint United Nations Programme on HIV/AIDS. (2020). Strategic Considerations for Mitigating the Impact of COVID-19 on Key-Population-Focused HIV Programs."]
[null,7,"Joint United Nations Programme on HIV/AIDS. (2020). Preventing HIV and other STIs among women and girls using contraceptive services in contexts with high HIV incidence. "]
[null,8,"Joint United Nations Programme on HIV/AIDS. (2021). Going Online: A Budgeting and Programming Aid for Virtual HIV Interventions. "]
[null,3,"Manual for MMC, Chapter 2: An opportunity for expanded services for adolescent boys and men. 2018. WHO"]
[null,4,"MMC Manual, Chapter 3: Facilities, Supplies and Infrastructure for MMC Programs. WHO, 2018"]
[null,5,"MMC Manual, Chapter 4: Recordkeeping, reporting and quality assurance. WHO, 2018"]
[null,6,"Policy Guidelines for Sustaining Medical Male Circumcision Services in Kenya. National AIDS & STI Control Program, Ministry of Health, 2018"]
[null,7,"South African National Guidelines for MMC, 2016, Department of Health for the Republic of South Africa "]
[null,8,"Sustainability Transition Implementation Plan 2019 - 2021 for VMMC. Zimbabwe Ministry pf Health & Child Care"]
[null,9,"UNAIDS (2018) VMMC Scorecard"]

{"sheet":"Acronyms","index":11,"n_rows":20,"n_cols":4,"rows_kept":20,"cut":false,"hidden":false,"merged":[[1,2,1,3]]}
[]
[null,null,"Acronyms"]
[null,null,"AE","Adverse event"]
[null,null,"AGYW","Adolescent girls and young women"]
[null,null,"HIV+ ","HIV positive"]
[null,null,"HTS","HIV testing services"]
[null,null,"IEC","Information, education and communication"]
[null,null,"KP","Key Populations"]
[null,null,"M&E","Monitoring and evaluation"]
[null,null,"MC / MMC / VMMC","Medical circumcision / medical male circumcision / voluntary medical male circumcision"]
[null,null,"MOU","Memorandum of understanding"]
[null,null,"PrEP","Pre-exposure prophylaxis"]
[null,null,"PSAT","HIV Prevention Self-Assessment Tools "]
[null,null,"QA","Quality assurance"]
[null,null,"SBCC","Social and behaviour change communication"]
[null,null,"SOP","Standard operating procedure"]
[null,null,"STI","Sexually transmitted infections"]
[null,null,"TWG","Technical working group"]
[null,null,"UNAIDS","United Nations Programme on HIV/AIDS"]
[null,null,"WHO","World Health Organization"]